program: Gaussian 09
title: 000066410
version: EM64L-G09RevD.01
frameworkgroup: C1[X(C20H28O2)]
method: RPBEPBE
basis: SDD
operation: Freq
keyword: #pfreq=noraman
keyword: PBEPBE/SDD
title: #p freq=noraman PBEPBE/SDD
converged: YES YES NO NO
title: Mulliken charges:
elementType: O O C C C C C C C C C C C C C C C C C C C C H H H H H H H H H H H H H H H H H H H H H H H H H H H H
charge: -0.450672 -0.439943 0.398407 -0.171909 -0.139968 -0.262031 -0.599682 0.002676 -0.165153 -0.531753 -0.512189 -0.452570 -0.793395 0.266201 -0.421228 -0.629330 0.415814 -0.715047 -0.392001 -0.648278 -0.406399 0.304735 0.205346 0.256061 0.210281 0.222271 0.212403 0.197447 0.200410 0.198346 0.193446 0.215059 0.203972 0.212060 0.215520 0.233606 0.213529 0.219305 0.198843 0.239571 0.226168 0.214452 0.333693 0.225216 0.205268 0.215660 0.251157 0.226760 0.247014 0.350856
chargesum: 0.00000
title: Mulliken charges with hydrogens summed into heavy atoms:
elementType: O O C C C C C C C C C C C C C C C C C C C C
charge: -0.116978 -0.089087 0.398407 0.033437 0.116092 -0.051751 -0.165009 0.200123 0.035256 -0.139961 -0.093159 -0.024990 -0.126956 0.266201 0.017185 -0.188711 0.415814 -0.068903 -0.140844 -0.421518 -0.159385 0.304735
polarizability: 2.80755940e+02 6.00639424e-01 2.10872815e+02 1.29051817e+01 -7.78991599e+00 1.53385073e+02
1716.lowfreq: -13.1822 -7.9240 -3.9476 0.0002 0.0005 0.0007 26.4997 49.1837 68.8842
frequency: 26.2377 49.0848 68.8637 80.2774 93.5664 109.7922 126.2038 152.6269 169.4836 207.4492 212.3912 226.4890 238.8582 254.8861 260.0939 272.5652 289.3614 296.0723 314.3429 335.9037 343.9920 368.7613 384.2883 397.4563 406.8658 433.7324 450.5292 460.6755 482.5324 500.3467 518.6073 525.8786 563.2923 581.0642 605.7285 641.7977 660.6174 710.3444 743.2966 750.5433 757.5135 790.8704 792.4669 822.2360 822.7763 833.9425 845.6026 855.0405 898.7238 916.9900 920.4700 945.9862 952.2172 959.5378 969.7958 986.2374 992.8884 1009.0072 1013.6740 1018.2051 1045.6480 1059.0214 1070.0578 1078.5425 1096.2784 1108.4761 1116.2054 1124.0982 1132.3679 1138.8004 1142.9089 1155.7892 1169.8091 1180.2712 1185.6761 1197.4785 1207.5908 1215.7982 1225.7740 1241.9791 1251.9824 1254.7801 1264.9077 1266.5705 1280.9859 1290.5466 1294.8591 1297.1570 1303.9834 1306.7928 1310.8414 1321.9701 1329.5484 1334.0113 1341.2388 1345.7174 1353.6815 1359.0130 1371.4372 1385.8226 1391.2229 1393.6153 1435.3675 1456.3732 1465.7737 1466.3424 1467.2534 1470.5197 1475.6859 1476.0245 1483.9960 1488.2713 1492.0783 1496.8229 1603.7041 1623.5155 2889.5735 2900.1729 2910.8214 2945.1313 2959.8383 2968.7140 2972.1240 2977.4841 2981.2146 2982.2677 2987.1855 2996.1285 2997.1684 3002.0032 3031.3152 3033.0550 3043.8464 3049.2918 3053.2621 3067.8740 3073.5860 3080.1457 3099.2986 3099.9727 3143.8103 3170.2052 3555.5616 3581.3951
redmass: 4.5858 2.9272 2.4883 2.8557 2.7783 2.7914 2.8860 1.4899 2.7658 2.6505 3.4457 1.7156 2.5096 2.6526 2.4650 1.4096 2.3832 2.9262 3.0859 2.5629 1.1561 2.9325 2.9363 3.1123 2.9618 2.7647 2.8869 3.6898 3.7042 4.1431 4.0254 3.6661 2.6864 3.0869 3.6230 3.1019 2.5844 4.4367 3.5263 3.1406 1.5364 2.4563 1.8161 1.6981 2.0188 1.8058 1.7031 1.8565 2.3864 2.6030 1.9378 1.5168 1.5158 2.0133 2.1602 2.2066 1.9312 2.4862 2.1140 2.1674 2.2030 2.2868 2.8063 2.1690 2.0050 2.0655 1.9913 2.0181 1.9355 1.8114 1.3930 1.7434 1.4063 1.3843 1.5221 1.5057 1.5634 1.5146 1.4776 1.4192 1.5249 1.4333 1.4135 2.3766 1.4168 1.3710 1.4171 1.3127 1.4175 1.3920 1.2878 1.3553 1.4456 1.4160 1.4941 1.5167 1.4988 1.4699 1.4325 1.2138 1.2405 4.7196 3.5437 1.0840 1.0898 1.0763 1.0840 1.0765 1.0484 1.0981 1.0690 1.0930 1.1235 2.3915 6.6497 6.7764 1.0808 1.0801 1.0839 1.0592 1.0654 1.0364 1.0824 1.0635 1.0749 1.0633 1.0690 1.0476 1.0600 1.0933 1.0956 1.1014 1.0977 1.1006 1.1003 1.0993 1.1001 1.0974 1.0911 1.0976 1.0877 1.0960 1.0660 1.0660
irintensity: 0.0774 0.4257 0.0279 0.5088 0.6014 1.0889 0.5433 2.6366 2.6186 1.2599 1.5671 3.0007 2.2669 13.9638 5.5368 88.3024 40.9082 10.1164 1.8094 5.0069 137.0797 0.0724 1.0364 0.7194 1.1314 3.2028 7.2585 19.6405 11.3658 7.2505 0.8885 0.1802 8.1743 3.6382 4.4018 3.4991 6.9336 5.6415 6.3173 2.9811 8.8112 4.2220 3.0953 12.7717 1.0586 15.0916 28.8059 13.3139 17.3964 3.8681 4.1153 3.3933 11.7197 9.6871 5.4836 2.2004 12.3534 41.2575 25.2626 7.7865 7.4789 0.6001 9.2043 11.1279 2.3334 6.7896 0.2556 2.1441 162.0599 98.8602 1.2250 5.9900 31.0397 10.4290 1.8415 16.3838 4.8147 19.0845 4.5079 6.3939 6.2607 1.1906 2.6433 24.6785 1.8487 1.6725 7.8621 0.9275 1.2981 1.6289 0.5122 0.3974 1.1520 5.5108 0.1726 0.4926 0.3422 0.6508 1.2553 13.9772 20.4224 9.3025 47.9398 4.7670 7.5322 3.0600 11.7529 7.4313 7.3898 8.6087 8.6190 11.6959 27.4626 50.7659 7.2539 61.0657 3.2904 19.7532 56.2816 57.7233 25.5028 35.4494 34.8735 21.5030 29.8322 16.3076 48.0967 1.4704 34.6650 69.8745 21.1834 54.0627 5.4617 46.6665 39.8263 61.1118 81.1149 38.3576 24.9442 25.1951 9.6567 10.5174 5.5895 36.3727
temp: 298.150 k
press: 1.00000 atm
elementType: 8 8 6 6 6 6 6 6 6 6 6 6 6 6 6 6 6 6 6 6 6 6 1 1 1 1 1 1 1 1 1 1 1 1 1 1 1 1 1 1 1 1 1 1 1 1 1 1 1 1
symmnumber: 1
zpe: 1141336.2 jmol-1
zpe.correction: 0.434712 hartree
zpe.thermalcorrener: 0.455629 hartree
zpe.thermalcorrenthalpy: 0.456573 hartree
zpe.thermalcorrgfe: 0.386417 hartree
zpe.sumelectzpe: -927.694698 hartree
zpe.sumelectthermal: -927.673781 hartree
zpe.sumelectthermalent: -927.672837 hartree
zpe.sumelectthermalfe: -927.742993 hartree
dipole: 0.2033 1.1323 -1.6489
dipole: 2.0106
quadrupole: -150.5706 -121.7888 -134.9418
quadrupole: 12.0911 1.0870 0.6098
quadrupole: -14.8035 13.9782 0.8252 12.0911 1.0870 0.6098
hfenergy: -928.1294098 hartree
pointgroup: C01 [X(C20H28O2)]
dipole: -0.0780787 -0.4386022 -0.6536295 debye
polarizability: 280.86618|0.5573146|210.7037186|-12.3384105|8.408201|153.4439303 unknown
InChI: InChI=1S/C20H28O2/c1-3-12-11-18-17-6-4-13-10-14(21)5-7-15(13)16(17)8-9-20(18,2)19(12)22/h5,7,10,12,16-19,21-22H,3-4,6,8-9,11H2,1-2H3
charge 0 multiplicity 1
50 atoms
O  4.494475 1.77151 0.007696
O  -6.325135 -0.382972 0.920625
C  2.039016 1.024219 -0.050448
C  1.466208 -0.370635 -0.4585
C  -0.008239 -0.569648 -0.055602
C  3.500694 0.859305 -0.577649
C  2.549125 -1.362583 0.032176
C  3.90407 -0.638581 -0.292686
C  -0.870062 0.578363 -0.703225
C  1.205396 2.116657 -0.764584
C  -0.300211 1.990836 -0.414336
C  -0.548664 -1.982217 -0.455596
C  2.051839 1.264867 1.481379
C  -2.324558 0.388063 -0.281916
C  4.993441 -0.828511 0.790116
C  -1.972222 -1.957279 -1.093291
C  -2.869684 -0.917152 -0.452541
C  5.472336 -2.293962 0.883314
C  -3.141136 1.395446 0.285243
C  -4.196116 -1.195207 -0.057773
C  -4.469963 1.128077 0.678433
C  -4.993407 -0.171401 0.50754
H  1.48793 -0.399863 -1.575386
H  -0.100831 -0.460543 1.043753
H  3.476175 1.02066 -1.680568
H  2.455319 -1.535406 1.122637
H  2.476187 -2.349286 -0.458371
H  4.315679 -1.059475 -1.23306
H  -0.805222 0.421083 -1.806343
H  1.334876 2.011082 -1.863187
H  1.559183 3.133233 -0.492457
H  -0.451447 2.239463 0.654339
H  -0.874388 2.741075 -0.993126
H  -0.563596 -2.630068 0.440249
H  0.146126 -2.456572 -1.175847
H  2.679606 0.527569 2.007227
H  2.474173 2.261084 1.705856
H  1.039501 1.220776 1.917668
H  4.60721 -0.499149 1.774151
H  5.846323 -0.164446 0.561583
H  -2.428001 -2.963661 -1.047895
H  -1.863677 -1.710701 -2.170454
H  4.25025 2.69986 -0.23659
H  4.643379 -2.978163 1.144652
H  5.896098 -2.634414 -0.081304
H  6.256877 -2.407954 1.654066
H  -2.748425 2.407291 0.425848
H  -4.603339 -2.207069 -0.193127
H  -5.10638 1.903174 1.115436
H  -6.595287 -1.320874 0.759576
