program: Orca
programVersion: 5.0.2
elementType: S P O O O O N C C C C C C C C C C H H H H H H H H H H H H H H H H H H H H
charge: 0
multiplicity: 1
keywords: wb97x-d3
keywords: def2-TZVPP
keywords: def2/J RIJCOSX
keywords: DEFGRID2
keywords: scfconv7
keywords: smallprint printgap noloewdin
keywords: NOSOSCF
formula: C10H20NO4PS
InChI: InChI=1/C10H20NO4PS/c1-6-11-16(17,13-5)15-9(4)7-10(12)14-8(2)3/h7-8,11H,6H2,1-5H3
37 atoms
S  -3.061138 -0.447872 1.736423
P  -2.144622 0.166776 0.157233
O  -0.549356 0.492082 0.300554
O  3.903832 0.233663 -0.461061
O  -2.024358 -0.90473 -1.040324
O  3.160941 -1.744536 0.280023
N  -2.686865 1.593736 -0.432074
C  5.273891 -0.225158 -0.508365
C  -3.9287 2.24913 -0.039917
C  0.497535 -0.384198 0.407012
C  5.900012 -0.13733 0.869693
C  5.976551 0.656229 -1.517952
C  -5.146448 1.755328 -0.795831
C  1.656839 0.092687 -0.072439
C  2.947889 -0.594037 -0.044764
C  0.242284 -1.678259 1.090752
C  -3.20823 -1.550984 -1.517584
H  5.290141 -1.259331 -0.859146
H  -3.791643 3.318584 -0.199516
H  -4.065876 2.110132 1.031093
H  -2.308528 1.888537 -1.32469
H  5.896835 0.889903 1.237396
H  6.93664 -0.471091 0.818683
H  5.388749 -0.767137 1.597023
H  5.523146 0.574751 -2.506079
H  7.018286 0.348794 -1.605677
H  5.962211 1.703952 -1.21362
H  -5.034208 1.902754 -1.870716
H  -5.317448 0.693484 -0.612574
H  -6.036028 2.299111 -0.475144
H  1.653927 1.08378 -0.50905
H  -0.34652 -2.347115 0.460878
H  -0.322701 -1.513155 2.007636
H  1.167196 -2.184108 1.338364
H  -2.890263 -2.299644 -2.238444
H  -3.745552 -2.041954 -0.705453
H  -3.871596 -0.839723 -2.011143
elementType: S P O N C H
totalener: -1488.51935151 hartree
nucrepener: 1566.12237612 hartree
electener: -3054.64172763 hartree
oneelecener: -5157.81173890 hartree
twoeener: 2103.17001126 hartree
cpcmener: -0.03021014 hartree
kineticenergy: 1483.73601884 hartree
xcener: -107.354516852635 hartree
chargesum: -0.0000000
charge: -0.467655 0.685244 -0.326340 -0.299900 -0.349565 -0.517182 -0.262045 0.160906 0.004903 0.234199 -0.262691 -0.252789 -0.258222 -0.291240 0.514616 -0.254403 -0.118745 0.063992 0.096661 0.082188 0.166963 0.089905 0.097166 0.093179 0.097597 0.090272 0.089075 0.088506 0.072646 0.095798 0.127710 0.119978 0.110669 0.114993 0.132045 0.106921 0.124649
qa: -0.4677 0.6852 -0.3263 -0.2999 -0.3496 -0.5172 -0.2620 0.1609 0.0049 0.2342 -0.2627 -0.2528 -0.2582 -0.2912 0.5146 -0.2544 -0.1187 0.0640 0.0967 0.0822 0.1670 0.0899 0.0972 0.0932 0.0976 0.0903 0.0891 0.0885 0.0726 0.0958 0.1277 0.1200 0.1107 0.1150 0.1320 0.1069 0.1246
va: 1.9649 5.4660 2.1770 2.1271 2.0456 1.9742 3.1406 3.8126 3.8408 3.7579 3.9070 3.9325 3.9102 3.8879 4.0936 3.9054 3.8417 1.0230 0.9981 1.0250 1.0183 1.0066 1.0059 1.0176 1.0080 1.0055 1.0070 1.0032 1.0104 1.0117 1.0326 1.0060 1.0137 1.0352 0.9921 1.0044 0.9847
dispcorr: -0.016101747 hartree
energy: -1488.535453258013
dipole: 8.75788 -9.46684 -0.70895 3.52830 -2.25583 1.27247 -7.78695 5.65913 -2.12782
magnitude: 2.57865 au
magnitude: 6.55440 debye
