program: Orca
programVersion: 5.0.2
elementType: S P O O O O N C C C C C C C C C C H H H H H H H H H H H H H H H H H H H H
charge: 0
multiplicity: 1
keywords: wb97x-d3
keywords: def2-TZVPP
keywords: def2/J RIJCOSX
keywords: DEFGRID2
keywords: scfconv7
keywords: smallprint printgap noloewdin
keywords: NOSOSCF
formula: C10H20NO4PS
InChI: InChI=1/C10H20NO4PS/c1-6-11-16(17,13-5)15-9(4)7-10(12)14-8(2)3/h7-8,11H,6H2,1-5H3
37 atoms
S  -2.640148 -0.907059 2.134992
P  -2.276574 -0.097383 0.426481
O  -0.710369 0.243336 0.102333
O  3.780626 0.551766 -0.350263
O  -2.590609 -0.974771 -0.88112
O  3.208232 -1.590536 -0.046133
N  -3.027502 1.336716 0.194808
C  5.185449 0.223048 -0.450748
C  -2.817142 2.18107 -0.980288
C  0.404005 -0.543047 0.077163
C  5.791673 0.100573 0.933547
C  5.822882 1.330064 -1.262229
C  -4.069462 2.961708 -1.319513
C  1.549065 0.145021 -0.071448
C  2.894207 -0.42126 -0.145431
C  0.219253 -2.011291 0.18794
C  -3.900139 -1.52447 -1.055027
H  5.290419 -0.722043 -0.987769
H  -2.542861 1.547194 -1.822768
H  -1.981633 2.864864 -0.813269
H  -3.29117 1.831245 1.036746
H  6.853912 -0.128817 0.845469
H  5.331727 -0.696607 1.516903
H  5.696101 1.035406 1.487877
H  5.735493 2.296367 -0.763266
H  5.376817 1.409321 -2.253924
H  6.883522 1.11696 -1.393363
H  -4.898518 2.295653 -1.558454
H  -4.373931 3.603603 -0.491757
H  -3.887269 3.600185 -2.183653
H  1.481173 1.222987 -0.150887
H  1.168837 -2.529495 0.215232
H  -0.350821 -2.387965 -0.662504
H  -0.337246 -2.262629 1.091733
H  -4.634314 -0.739963 -1.239471
H  -3.853301 -2.180201 -1.92018
H  -4.202728 -2.10547 -0.183028
elementType: S P O N C H
totalener: -1488.52219302 hartree
nucrepener: 1562.36890324 hartree
electener: -3050.89109626 hartree
oneelecener: -5150.18303725 hartree
twoeener: 2099.29194099 hartree
cpcmener: -0.02889856 hartree
kineticenergy: 1483.73712581 hartree
xcener: -107.353833239913 hartree
chargesum: 0.0000000
charge: -0.459051 0.623039 -0.289580 -0.302613 -0.345625 -0.520494 -0.248242 0.162087 -0.021103 0.248763 -0.265220 -0.253473 -0.254140 -0.306625 0.519671 -0.259792 -0.099122 0.064230 0.100498 0.094066 0.167832 0.097478 0.093679 0.090201 0.088907 0.097028 0.090865 0.081618 0.088046 0.088484 0.127111 0.115642 0.125260 0.109666 0.117298 0.128744 0.104866
qa: -0.4591 0.6230 -0.2896 -0.3026 -0.3456 -0.5205 -0.2482 0.1621 -0.0211 0.2488 -0.2652 -0.2535 -0.2541 -0.3066 0.5197 -0.2598 -0.0991 0.0642 0.1005 0.0941 0.1678 0.0975 0.0937 0.0902 0.0889 0.0970 0.0909 0.0816 0.0880 0.0885 0.1271 0.1156 0.1253 0.1097 0.1173 0.1287 0.1049
va: 1.9922 5.5040 2.1547 2.1242 2.0413 1.9729 3.1098 3.8094 3.8729 3.7538 3.9086 3.9307 3.9537 3.8573 4.1004 3.8839 3.8322 1.0234 1.0043 0.9992 1.0180 1.0055 1.0167 1.0066 1.0069 1.0084 1.0051 1.0052 1.0002 1.0070 1.0322 1.0406 1.0049 1.0230 0.9919 0.9903 1.0065
dispcorr: -0.015805454 hartree
energy: -1488.537998473335
dipole: 10.76922 -11.78686 -1.01764 8.80972 -7.10093 1.70879 -10.45136 8.75899 -1.69236
magnitude: 2.61145 au
magnitude: 6.63778 debye
