program: Orca
programVersion: 5.0.2
elementType: S P O O O O N C C C C C C C C C C H H H H H H H H H H H H H H H H H H H H
charge: 0
multiplicity: 1
keywords: wb97x-d3
keywords: def2-TZVPP
keywords: def2/J RIJCOSX
keywords: DEFGRID2
keywords: scfconv7
keywords: smallprint printgap noloewdin
keywords: NOSOSCF
formula: C10H20NO4PS
InChI: InChI=1/C10H20NO4PS/c1-6-11-16(17,13-5)15-9(4)7-10(12)14-8(2)3/h7-8,11H,6H2,1-5H3
37 atoms
S  -1.382787 1.114686 1.543567
P  -2.095444 0.0178 0.131813
O  -1.061476 -0.344199 -1.081041
O  3.310978 0.404127 0.058679
O  -2.514035 -1.480478 0.521706
O  3.013201 -1.74588 -0.486184
N  -3.40563 0.642169 -0.630773
C  4.71264 0.218539 0.344866
C  -3.607256 2.069235 -0.848514
C  0.165458 -0.947619 -0.933405
C  4.888089 -0.348362 1.740699
C  5.350352 1.582882 0.191695
C  -2.736879 2.656441 -1.944227
C  1.184834 -0.185559 -0.520935
C  2.570996 -0.629612 -0.328596
C  0.153617 -2.374736 -1.341218
C  -3.373688 -1.723608 1.635518
H  5.139842 -0.467081 -0.391101
H  -3.429079 2.5855 0.094956
H  -4.662409 2.208888 -1.084705
H  -3.846315 0.039895 -1.31652
H  4.432036 -1.332473 1.847022
H  4.455143 0.316078 2.490815
H  5.950678 -0.454522 1.962089
H  4.93168 2.301527 0.89874
H  5.219083 1.975315 -0.817483
H  6.421016 1.512707 0.382788
H  -1.677933 2.594752 -1.687437
H  -2.886939 2.137658 -2.892322
H  -2.978244 3.709289 -2.097519
H  0.987573 0.855437 -0.301269
H  1.14321 -2.815736 -1.340842
H  -0.269631 -2.468237 -2.343598
H  -0.484513 -2.954604 -0.67091
H  -3.005504 -1.232891 2.537893
H  -4.389292 -1.382637 1.429859
H  -3.384606 -2.79922 1.797686
elementType: S P O N C H
totalener: -1488.52942927 hartree
nucrepener: 1598.51150489 hartree
electener: -3087.04093416 hartree
oneelecener: -5223.02527543 hartree
twoeener: 2135.98434127 hartree
cpcmener: -0.02465315 hartree
kineticenergy: 1483.74868826 hartree
xcener: -107.351821823793 hartree
chargesum: -0.0000000
charge: -0.460896 0.704651 -0.357989 -0.288084 -0.351837 -0.484202 -0.271301 0.155829 -0.018518 0.266550 -0.262931 -0.252189 -0.234731 -0.277460 0.498645 -0.240567 -0.112687 0.064216 0.086589 0.092188 0.162879 0.095314 0.089748 0.094920 0.088469 0.096615 0.089069 0.074262 0.082012 0.089890 0.118358 0.107261 0.107738 0.104769 0.102155 0.116784 0.124480
qa: -0.4609 0.7047 -0.3580 -0.2881 -0.3518 -0.4842 -0.2713 0.1558 -0.0185 0.2666 -0.2629 -0.2522 -0.2347 -0.2775 0.4986 -0.2406 -0.1127 0.0642 0.0866 0.0922 0.1629 0.0953 0.0897 0.0949 0.0885 0.0966 0.0891 0.0743 0.0820 0.0899 0.1184 0.1073 0.1077 0.1048 0.1022 0.1168 0.1245
va: 1.9816 5.4612 2.0945 2.1349 2.1008 2.0185 3.1223 3.8207 3.8896 3.6744 3.9047 3.9325 3.8959 3.9256 4.1385 3.9554 3.8603 1.0217 1.0209 0.9978 1.0217 1.0169 1.0068 1.0064 1.0072 1.0082 1.0057 1.0120 1.0071 1.0105 1.0405 1.0333 1.0020 1.0091 1.0032 0.9935 0.9898
dispcorr: -0.016169906 hartree
energy: -1488.545599179255
dipole: 8.70823 -10.36355 -1.65532 3.79213 -3.80512 -0.01299 -1.80344 0.99446 -0.80898
magnitude: 1.84247 au
magnitude: 4.68319 debye
