program: Gaussian 09
title: 000066401
version: EM64L-G09RevD.01
frameworkgroup: C1[X(C18H23BrO2)]
method: RPBEPBE
basis: SDD
operation: Freq
keyword: #p
keyword: freq=noraman
keyword: PBEPBE/SDD
title: #p freq=noraman PBEPBE/SDD
converged: NO YES NO NO
title: Mulliken charges:
elementType: Br O O C C C C C C C C C C C C C C C C C C H H H H H H H H H H H H H H H H H H H H H H H
charge: -0.051839 -0.440471 -0.437806 0.379428 -0.141384 -0.117479 -0.164355 -0.151282 -0.520182 -0.525940 -0.489210 -0.553573 -0.506975 -0.816023 0.251943 -0.578703 0.301011 -0.344171 -0.537350 -0.446513 0.287312 0.234539 0.248234 0.206561 0.242537 0.196989 0.229703 0.244606 0.258218 0.225129 0.194686 0.320226 0.221642 0.218381 0.224694 0.215315 0.263519 0.223919 0.229186 0.355970 0.222600 0.255717 0.218467 0.352724
chargesum: 0.00000
title: Mulliken charges with hydrogens summed into heavy atoms:
elementType: Br O O C C C C C C C C C C C C C C C C C C
charge: -0.051839 -0.084501 -0.085082 0.379428 0.093155 0.130755 0.042206 0.091256 -0.093489 -0.023116 -0.069396 -0.233347 -0.066952 -0.112494 0.251943 -0.125598 0.301011 -0.121571 -0.281633 -0.228046 0.287312
polarizability: 2.95055209e+02 -9.45452507e+00 1.96147159e+02 -8.58057903e+00 -9.11870027e+00 1.40287753e+02
1716.lowfreq: -16.3035 -0.0004 0.0002 0.0002 0.9253 7.7155 24.4964 49.1052 55.4692
frequency: 23.7598 48.9673 55.3541 88.2447 100.4134 135.6427 155.4059 164.2505 182.6798 206.7393 218.6885 230.5909 251.6346 264.1617 276.7185 309.2451 325.2438 333.4686 344.0839 353.4447 375.7285 401.3743 418.6926 440.5924 447.5885 458.7778 480.5845 507.2808 510.1358 550.2942 564.0709 581.0573 621.1646 624.8536 666.4279 707.5124 722.5264 750.8871 777.1636 807.7559 824.8982 846.3427 850.6459 885.3351 904.9698 914.0006 923.1531 929.6686 945.7447 962.3484 978.9739 995.1598 1008.4124 1018.8210 1026.9071 1048.1156 1057.4017 1074.4725 1095.1115 1102.1942 1121.4767 1134.0470 1137.7609 1148.2657 1156.5622 1169.2805 1177.1492 1179.4227 1181.2086 1198.2210 1210.1685 1221.5423 1236.4744 1244.6098 1253.0198 1258.5208 1263.5056 1277.8851 1281.9407 1288.3098 1302.5129 1308.7147 1319.9131 1328.3074 1334.2975 1337.2911 1343.6927 1354.2608 1372.1107 1382.7173 1385.0442 1403.1644 1442.1192 1458.5308 1459.7304 1463.7742 1469.8235 1471.5252 1481.7003 1487.1664 1495.4316 1586.7181 1631.5700 2898.9722 2922.5872 2959.3967 2960.0682 2961.0014 2965.7219 2971.6699 2986.7378 2993.4675 3002.2323 3021.8290 3033.8469 3034.4265 3044.1203 3078.9948 3080.1703 3093.4816 3095.8246 3112.7910 3142.3212 3151.9535 3559.1300 3584.3405
redmass: 6.1906 5.2317 5.0646 4.6953 4.5879 1.2246 3.7043 5.8896 2.7818 3.4896 2.5159 3.8096 3.4749 4.2600 2.3913 3.0119 1.2465 2.8906 1.1283 2.6379 3.0856 3.8507 3.4723 3.2411 3.1455 3.7447 2.7726 3.2720 3.3860 4.5525 3.1241 3.5818 4.0027 2.8538 2.8429 3.9100 4.4275 3.1634 1.9788 1.8701 1.8804 2.1846 2.1007 1.5903 2.1859 2.7612 1.7696 1.5711 2.2767 1.8914 1.8780 2.0964 3.2165 2.4326 2.8431 3.1192 2.3702 2.8256 1.7971 2.1963 1.8986 1.7050 1.5084 1.3658 1.3357 1.6706 1.4917 1.4550 1.6033 1.3848 1.6581 1.7139 1.3814 1.3186 1.5288 2.5168 1.4943 1.4110 1.4145 1.3484 1.3464 1.6580 1.3637 1.5298 1.5215 1.3486 1.4607 1.4922 1.5419 3.3638 1.3619 1.3481 2.9348 1.1591 1.0911 1.0818 1.0776 1.0944 1.0697 1.0652 2.6856 7.1594 6.4627 1.0802 1.0797 1.0776 1.0651 1.0718 1.0738 1.0699 1.0593 1.0395 1.0645 1.0935 1.0962 1.1016 1.1021 1.0971 1.0962 1.0897 1.0994 1.0890 1.0916 1.0934 1.0659 1.0660
irintensity: 0.0805 0.7294 0.3035 0.6125 0.4570 0.1389 2.3580 4.9538 2.2356 3.8005 3.6196 1.0418 3.7956 2.0546 5.2026 4.8631 117.5814 31.6548 142.7133 1.4900 2.9698 9.4728 2.9979 2.0066 3.1851 0.3580 0.1663 0.5808 0.9928 1.5603 9.2914 20.4487 13.4391 3.0191 22.7585 2.3011 3.2108 10.4359 19.9275 25.2432 2.5383 5.7232 0.9094 29.7044 52.2631 3.5270 10.2966 8.1004 6.0573 12.6596 18.5774 2.1530 41.3528 14.8885 24.9607 4.8778 19.7523 9.3967 27.6543 14.8249 26.0694 15.0276 25.3096 75.8005 6.8653 19.9059 43.6792 17.3995 0.7986 17.5403 16.9006 10.1445 3.6191 38.9412 7.8933 21.5211 0.9767 21.8793 0.6981 13.6657 1.7655 18.0857 0.5551 0.9771 1.6468 2.1961 0.8225 4.4648 3.1660 22.0159 19.1549 6.8311 7.1982 5.6702 2.0946 18.1962 8.9323 6.2087 4.7704 12.5906 98.7013 29.3309 51.0170 14.1302 10.5526 3.3675 26.5015 12.4708 41.9897 61.6259 26.3659 18.8708 21.8209 35.1663 28.8595 51.5662 58.3636 32.7258 11.0004 13.1608 18.2522 21.3741 11.4025 14.2581 6.6844 39.1769
temp: 298.150 k
press: 1.00000 atm
elementType: 35 8 8 6 6 6 6 6 6 6 6 6 6 6 6 6 6 6 6 6 6 1 1 1 1 1 1 1 1 1 1 1 1 1 1 1 1 1 1 1 1 1 1 1
symmnumber: 1
zpe: 970712.5 jmol-1
zpe.correction: 0.369725 hartree
zpe.thermalcorrener: 0.389215 hartree
zpe.thermalcorrenthalpy: 0.390159 hartree
zpe.thermalcorrgfe: 0.321911 hartree
zpe.sumelectzpe: -862.049183 hartree
zpe.sumelectthermal: -862.029693 hartree
zpe.sumelectthermalent: -862.028749 hartree
zpe.sumelectthermalfe: -862.096997 hartree
dipole: -1.4636 1.2244 -0.3856
dipole: 1.9468
quadrupole: -140.6402 -135.1873 -135.5183
quadrupole: -8.4875 3.9849 -5.3808
quadrupole: -3.5250 1.9280 1.5970 -8.4875 3.9849 -5.3808
hfenergy: -862.4189077 hartree
pointgroup: C01 [X(C18H23Br1O2)]
dipole: 0.5280073 -0.5477926 -0.0880629 debye
polarizability: 291.0330742|-18.5388247|199.9885176|16.9510584|2.752274|140.4685285 unknown
InChI: InChI=1S/C18H23BrO2/c1-18-7-6-13-12-5-3-11(20)8-10(12)2-4-14(13)15(18)9-16(19)17(18)21/h3,5,8,13-17,20-21H,2,4,6-7,9H2,1H3
charge 0 multiplicity 1
44 atoms
Br -5.568717 1.70752 -0.915881
O  -4.743592 -1.631935 0.295273
O  6.221774 0.089574 0.250982
C  -2.372846 -0.835893 0.230409
C  -1.772416 0.546182 -0.193915
C  -0.290171 0.677969 0.188611
C  0.505036 -0.445754 -0.550981
C  -3.840267 -0.616546 -0.233723
C  -1.609666 -1.95015 -0.521791
C  -2.80258 1.590423 0.321392
C  -0.080064 -1.861065 -0.265122
C  -4.152976 0.818777 0.276792
C  0.319901 2.049859 -0.169169
C  -2.34395 -1.093841 1.760835
C  2.016898 -0.328397 -0.293501
C  1.756893 2.155588 0.377904
C  2.602904 0.913629 0.102926
C  2.881466 -1.432954 -0.5016
C  4.002667 1.011546 0.274258
C  4.278328 -1.339242 -0.330473
C  4.838651 -0.101889 0.060783
H  -1.8165 0.577653 -1.307285
H  -0.184077 0.53307 1.285144
H  0.34251 -0.254365 -1.638425
H  -3.863215 -0.619741 -1.345289
H  -1.80096 -1.847407 -1.610789
H  -1.98389 -2.947247 -0.221514
H  -2.58575 1.901798 1.36117
H  -2.822364 2.502667 -0.295892
H  0.156281 -2.149785 0.777549
H  0.415528 -2.609602 -0.911551
H  -4.667316 0.780252 1.249485
H  -0.294775 2.871232 0.246377
H  0.319972 2.170221 -1.272251
H  -1.325323 -1.313366 2.121028
H  -2.721866 -0.234372 2.343664
H  -2.987306 -1.959559 1.992612
H  1.71197 2.313586 1.475869
H  2.263936 3.047183 -0.038053
H  -5.640143 -1.503151 -0.106602
H  2.464985 -2.397267 -0.809027
H  4.46132 1.960263 0.57416
H  4.916608 -2.215892 -0.501881
H  6.717401 -0.747468 0.071791
