program: Orca
programVersion: 5.0.2
elementType: S P O O O O N C C C C C C C C C C H H H H H H H H H H H H H H H H H H H H
charge: 0
multiplicity: 1
keywords: wb97x-d3
keywords: def2-TZVPP
keywords: def2/J RIJCOSX
keywords: DEFGRID2
keywords: scfconv7
keywords: smallprint printgap noloewdin
keywords: NOSOSCF
formula: C10H20NO4PS
InChI: InChI=1/C10H20NO4PS/c1-6-11-16(17,13-5)15-9(4)7-10(12)14-8(2)3/h7-8,11H,6H2,1-5H3
37 atoms
S  -2.583728 -1.676889 0.300089
P  -2.035348 0.033617 -0.391462
O  -0.909811 0.810255 0.501435
O  3.473677 -0.049354 -0.527545
O  -1.271608 0.026369 -1.800689
O  2.958103 -0.898179 1.478485
N  -3.238589 1.135812 -0.578144
C  4.857433 -0.449905 -0.421062
C  -4.345477 1.276192 0.3635
C  0.250606 0.232546 0.966468
C  5.629939 0.56431 0.399815
C  5.373532 -0.556196 -1.839949
C  -3.973676 1.963943 1.664467
C  1.305379 0.216974 0.143126
C  2.636736 -0.306072 0.472497
C  0.138152 -0.2178 2.374853
C  -1.810848 -0.703772 -2.904741
H  4.907935 -1.431015 0.057507
H  -4.749667 0.283186 0.560089
H  -5.12845 1.834984 -0.149373
H  -2.955155 2.006017 -1.01531
H  5.266361 0.629488 1.425235
H  5.576478 1.557555 -0.049673
H  6.680638 0.274857 0.443992
H  5.333491 0.405009 -2.355409
H  4.804561 -1.283975 -2.419877
H  6.412868 -0.884668 -1.827304
H  -4.862363 2.113288 2.279561
H  -3.267223 1.370153 2.246196
H  -3.526677 2.942692 1.483744
H  1.194193 0.642961 -0.845589
H  -0.296287 0.578982 2.981133
H  1.091201 -0.503527 2.802906
H  -0.541932 -1.071171 2.434474
H  -2.765695 -0.285415 -3.226001
H  -1.092788 -0.6201 -3.717288
H  -1.944253 -1.757018 -2.653902
elementType: S P O N C H
totalener: -1488.53006082 hartree
nucrepener: 1592.50316968 hartree
electener: -3081.03323050 hartree
oneelecener: -5210.78685129 hartree
twoeener: 2129.75362079 hartree
cpcmener: -0.02436184 hartree
kineticenergy: 1483.74417343 hartree
xcener: -107.349819534912 hartree
chargesum: 0.0000000
charge: -0.464880 0.704887 -0.352867 -0.290473 -0.349619 -0.482060 -0.269065 0.156943 -0.020177 0.239378 -0.262017 -0.251064 -0.235211 -0.274382 0.494441 -0.232860 -0.112841 0.064552 0.085666 0.093100 0.160515 0.094551 0.089290 0.094959 0.088121 0.096411 0.089234 0.090865 0.072773 0.082626 0.128011 0.109305 0.111266 0.102367 0.117698 0.125493 0.105064
qa: -0.4649 0.7049 -0.3529 -0.2905 -0.3496 -0.4821 -0.2691 0.1569 -0.0202 0.2394 -0.2620 -0.2511 -0.2352 -0.2744 0.4944 -0.2329 -0.1128 0.0646 0.0857 0.0931 0.1605 0.0946 0.0893 0.0950 0.0881 0.0964 0.0892 0.0909 0.0728 0.0826 0.1280 0.1093 0.1113 0.1024 0.1177 0.1255 0.1051
va: 1.9729 5.4551 2.0927 2.1364 2.0934 2.0175 3.1238 3.8198 3.8950 3.7226 3.9061 3.9327 3.8985 3.9465 4.1265 3.9451 3.8557 1.0223 1.0207 0.9975 1.0231 1.0175 1.0071 1.0062 1.0069 1.0084 1.0057 1.0106 1.0108 1.0067 1.0340 1.0004 1.0326 1.0159 0.9932 0.9902 1.0022
dispcorr: -0.016299991 hartree
energy: -1488.546360813520
dipole: 10.95040 -11.35751 -0.40711 6.87992 -5.02223 1.85770 -0.91987 -0.56442 -1.48429
magnitude: 2.41244 au
magnitude: 6.13194 debye
