program: Orca
programVersion: 5.0.2
elementType: S P O O O O N C C C C C C C C C C H H H H H H H H H H H H H H H H H H H H
charge: 0
multiplicity: 1
keywords: wb97x-d3
keywords: def2-TZVPP
keywords: def2/J RIJCOSX
keywords: DEFGRID2
keywords: scfconv7
keywords: smallprint printgap noloewdin
keywords: NOSOSCF
formula: C10H20NO4PS
InChI: InChI=1/C10H20NO4PS/c1-6-11-16(17,13-5)15-9(4)7-10(12)14-8(2)3/h7-8,11H,6H2,1-5H3
37 atoms
S  -2.611455 -0.653599 1.624295
P  -2.053078 -0.113682 -0.137302
O  -0.862783 1.002166 -0.183768
O  3.491043 -0.365936 -0.576534
O  -1.357965 -1.240895 -1.040453
O  3.09488 0.407833 1.486062
N  -3.235167 0.522168 -1.084296
C  4.878159 -0.636881 -0.28083
C  -4.317829 1.348064 -0.561526
C  0.333343 0.897288 0.490493
C  5.612344 -0.572161 -1.602713
C  5.007406 -1.991174 0.388984
C  -3.898951 2.759238 -0.190728
C  1.346407 0.305127 -0.152866
C  2.707856 0.141535 0.370319
C  0.305345 1.548885 1.823119
C  -2.030682 -2.477798 -1.280669
H  5.259809 0.142957 0.382062
H  -4.745419 0.839645 0.302472
H  -5.096324 1.371809 -1.324516
H  -2.941313 0.770749 -2.022422
H  5.501646 0.404537 -2.075514
H  5.257918 -1.335247 -2.298141
H  6.676671 -0.740219 -1.437787
H  4.621569 -2.78513 -0.253144
H  4.479584 -2.031017 1.341904
H  6.058584 -2.203308 0.587491
H  -3.178843 2.75953 0.62919
H  -3.447289 3.276035 -1.038945
H  -4.764736 3.339856 0.130416
H  1.172674 -0.072507 -1.152556
H  -0.125201 2.548056 1.732344
H  1.288412 1.627797 2.2717
H  -0.342004 0.982989 2.497208
H  -2.931183 -2.327245 -1.878388
H  -1.339053 -3.110792 -1.832434
H  -2.297515 -2.972771 -0.345724
elementType: S P O N C H
totalener: -1488.52974320 hartree
nucrepener: 1591.76053483 hartree
electener: -3080.29027803 hartree
oneelecener: -5209.28570187 hartree
twoeener: 2128.99542383 hartree
cpcmener: -0.02443247 hartree
kineticenergy: 1483.74940621 hartree
xcener: -107.351059333609 hartree
chargesum: -0.0000000
charge: -0.463821 0.704947 -0.354130 -0.291903 -0.346990 -0.482506 -0.272644 0.158192 -0.018766 0.249261 -0.250508 -0.263730 -0.236182 -0.281887 0.496631 -0.234178 -0.112274 0.063224 0.087002 0.092540 0.161409 0.095926 0.087842 0.089573 0.089569 0.095897 0.095349 0.072140 0.083110 0.091032 0.126566 0.110075 0.111318 0.103566 0.116348 0.124874 0.103127
qa: -0.4638 0.7049 -0.3541 -0.2919 -0.3470 -0.4825 -0.2726 0.1582 -0.0188 0.2493 -0.2505 -0.2637 -0.2362 -0.2819 0.4966 -0.2342 -0.1123 0.0632 0.0870 0.0925 0.1614 0.0959 0.0878 0.0896 0.0896 0.0959 0.0953 0.0721 0.0831 0.0910 0.1266 0.1101 0.1113 0.1036 0.1163 0.1249 0.1031
va: 1.9745 5.4548 2.0950 2.1349 2.0980 2.0177 3.1170 3.8180 3.8930 3.7062 3.9306 3.9102 3.8989 3.9597 4.1217 3.9445 3.8599 1.0235 1.0203 0.9979 1.0225 1.0086 1.0071 1.0055 1.0068 1.0154 1.0061 1.0121 1.0063 1.0106 1.0339 1.0005 1.0328 1.0172 0.9946 0.9902 1.0019
dispcorr: -0.016209309 hartree
energy: -1488.545952510414
dipole: 10.13125 -10.63441 -0.50316 0.82701 -0.70783 0.11917 -5.98594 3.57679 -2.40915
magnitude: 2.46402 au
magnitude: 6.26304 debye
