program: Gaussian 09
title: 000066358
version: EM64L-G09RevD.01
frameworkgroup: C1[X(C6H14O2S)]
method: RPBEPBE
basis: SDD
operation: Freq
keyword: #p
keyword: freq=noraman
keyword: PBEPBE/SDD
title: #p freq=noraman PBEPBE/SDD
converged: NO NO NO NO
title: Mulliken charges:
elementType: S O O C C C C C C H H H H H H H H H H H H H H
charge: 0.179129 -0.450703 -0.450707 -0.650677 -0.650805 -0.343506 -0.343545 -0.307280 -0.307247 0.242042 0.241972 0.242010 0.241937 0.233578 0.233504 0.233579 0.233507 0.184311 0.184440 0.184305 0.184432 0.342865 0.342860
chargesum: 0.00000
title: Mulliken charges with hydrogens summed into heavy atoms:
elementType: S O O C C C C C C
charge: 0.179129 -0.107838 -0.107847 -0.166663 -0.166858 0.123575 0.123541 0.061471 0.061490
polarizability: 1.34412462e+02 5.26774335e-03 7.89859117e+01 9.65655100e-03 1.32500458e-04 6.35185072e+01
1716.lowfreq: -0.0027 -0.0023 0.0007 1.9768 4.9624 16.0212 30.9338 49.6082 54.0310
frequency: 26.2474 49.5575 54.0310 91.3972 93.7302 115.5842 121.7377 149.5591 193.1138 261.8026 277.2372 278.3348 347.4329 412.6479 457.2364 708.8555 724.7330 776.6009 784.9802 854.1706 867.2606 978.4591 979.7354 997.6420 1016.2841 1034.0737 1050.3966 1057.0985 1066.8985 1157.5300 1159.3441 1196.2125 1212.2604 1243.9961 1257.0764 1261.8678 1268.8396 1285.1062 1285.5718 1326.8442 1340.4957 1417.0303 1417.2429 1456.4066 1463.3547 1475.0602 1475.3536 1488.7444 1488.7848 2922.7214 2922.9124 2969.5430 2969.7025 2984.2181 2985.4545 3010.6089 3011.0581 3042.9885 3046.1353 3079.6973 3080.7146 3562.4412 3562.4910
redmass: 6.0945 2.3255 6.0929 2.3101 2.4430 2.7546 2.3300 4.5671 6.2120 3.9416 1.0822 1.0815 6.2651 4.2601 3.9252 6.3001 7.0926 1.0821 1.0810 1.1859 1.2014 6.4049 6.8380 3.1675 2.6330 1.1935 1.2446 2.7480 3.0146 1.2389 1.2260 1.1464 1.2281 1.2548 1.2357 1.2426 1.2421 1.0963 1.0896 1.3887 1.3853 1.4276 1.4319 1.0864 1.0881 1.0773 1.0757 1.0873 1.0872 1.0544 1.0545 1.1072 1.1072 1.0558 1.0561 1.0590 1.0590 1.1068 1.1063 1.1057 1.1065 1.0665 1.0664
irintensity: 0.8618 0.0002 0.1000 0.0024 5.2139 7.7778 0.0014 3.6243 0.4479 0.0807 0.4342 325.3887 2.1803 47.2469 1.0329 19.6519 0.0321 0.0003 15.0675 0.0000 1.5476 145.1960 30.1694 14.7208 10.3136 0.0007 0.0536 8.9161 0.0030 0.0007 1.9002 13.1010 31.3873 3.9322 0.0001 0.8954 25.7307 0.0023 3.7423 55.2757 0.5396 15.5786 0.6000 6.8640 1.1327 0.5383 6.5190 2.6863 6.9747 5.4386 129.0962 1.7108 121.8462 64.5968 4.6848 42.4230 2.3078 16.4705 0.0670 105.3273 0.3592 2.1853 2.8076
temp: 298.150 k
press: 1.00000 atm
elementType: 16 8 8 6 6 6 6 6 6 1 1 1 1 1 1 1 1 1 1 1 1 1 1
symmnumber: 1
zpe: 512328.6 jmol-1
zpe.correction: 0.195136 hartree
zpe.thermalcorrener: 0.207909 hartree
zpe.thermalcorrenthalpy: 0.208853 hartree
zpe.thermalcorrgfe: 0.153976 hartree
zpe.sumelectzpe: -784.742366 hartree
zpe.sumelectthermal: -784.729592 hartree
zpe.sumelectthermalent: -784.728648 hartree
zpe.sumelectthermalfe: -784.783525 hartree
dipole: 0.0009 5.3934 0.0001
dipole: 5.3934
quadrupole: -52.8120 -64.5932 -64.6022
quadrupole: -0.0006 0.0969 -0.0002
quadrupole: 7.8571 -3.9241 -3.9330 -0.0006 0.0969 -0.0002
hfenergy: -784.9375012 hartree
pointgroup: C01 [X(C6H14O2S1)]
dipole: 0.0005387 2.1219144 -0.0000659 debye
dipolederiv: -0.3148589 0.0000184 -0.0001736 -0.000198 -0.0197639 -0.0000127 -0.0001427 -0.0000055 -0.1968362 -0.8478617 0.2507832 0.0010093 0.302156 -0.2617381 0.0016117 0.0014067 0.0014328 -0.591348 -0.8480583 -0.2506467 0.0010087 -0.3019826 -0.2615222 -0.0016351 0.0014028 -0.0014547 -0.5913451 0.2402944 0.1383392 0.0000359 0.186386 0.0862519 0.0001528 -0.0000583 0.0002102 0.1875539 0.23977 -0.1384651 0.0000468 -0.1866327 0.0863027 -0.0001397 -0.0000403 -0.0002036 0.1875953 -0.1491325 -0.0141431 -0.0001956 -0.254567 0.0193613 -0.0003979 -0.0004817 -0.000246 0.111099 -0.1489821 0.0141784 -0.0002044 0.2546859 0.0194295 0.0004073 -0.0005057 0.0002476 0.1111528 0.7134865 -0.1835531 -0.0003991 -0.0658445 0.3355927 -0.0004688 -0.0003154 -0.0005161 0.4595155 0.7136142 0.1834232 -0.0003962 0.0657546 0.335419 0.0004764 -0.0003067 0.0005269 0.4594932 -0.0181811 -0.0236542 -0.0099684 -0.0508033 -0.0630077 0.112466 -0.0085967 0.1229895 -0.0614325 -0.0180724 -0.0235882 0.009967 -0.0507799 -0.0629831 -0.1125635 0.008602 -0.1230525 -0.0615526 -0.0181669 0.0237231 -0.0099265 0.0509333 -0.0631052 -0.1125402 -0.0085213 -0.123047 -0.0614843 -0.0180568 0.0236383 0.0099363 0.0508939 -0.0630438 0.1126383 0.0085295 0.1231132 -0.0616386 0.0901803 -0.003419 -0.0056924 0.0108764 0.0028126 -0.1004572 0.0181177 -0.0980425 -0.0448393 0.090221 -0.0039004 0.0059115 0.0106426 0.002001 0.1007117 -0.0177517 0.09827 -0.0442675 0.0901981 0.0034107 -0.0056706 -0.0108692 0.0027927 0.1004624 0.0181466 0.0980466 -0.0448603 0.090237 0.0038967 0.0058981 -0.0106302 0.0019631 -0.1007221 -0.0177709 -0.0982767 -0.0442685 -0.02682 0.0485771 -0.0114148 0.0448787 -0.0874376 0.1251644 -0.010551 0.1620341 -0.1265304 -0.0269077 0.0480981 0.0114409 0.0443919 -0.0854334 -0.1249228 0.0104731 -0.1618067 -0.1283788 -0.0268648 -0.0485882 -0.0114537 -0.0448959 -0.0874081 -0.1251649 -0.0106163 -0.1620279 -0.1265199 -0.026955 -0.0481243 0.0114934 -0.044421 -0.0853876 0.124918 0.0105519 0.1617942 -0.1283841 0.1104115 -0.1246331 -0.0006183 -0.1732919 0.1245115 -0.0012774 -0.0007771 -0.0012248 0.3986408 0.1105052 0.1246292 -0.0006343 0.1733169 0.124393 0.0012934 -0.0007946 0.0012388 0.3986358 unknown
polarizability: 134.412445|0.0006933|78.9859112|0.0362365|-0.0007512|63.5185245 unknown
InChI: InChI=1S/C6H14O2S/c7-3-1-5-9-6-2-4-8/h7-8H,1-6H2
charge 0 multiplicity 1
23 atoms
S  -0.00002 -0.827777 0.000101
O  5.176609 -0.25033 -0.000127
O  -5.176363 -0.249251 0.00003
C  1.434742 0.40678 0.000703
C  -1.43422 0.406717 -0.00066
C  2.770339 -0.35978 0.001034
C  -2.770137 -0.359555 -0.001009
C  3.971778 0.594518 0.003563
C  -3.971211 0.595151 -0.003627
H  1.339142 1.043573 -0.899082
H  1.338451 1.043429 0.900529
H  -1.338903 1.043748 0.899043
H  -1.338115 1.043476 -0.900488
H  2.836559 -1.010668 -0.890525
H  2.834411 -1.013576 0.890616
H  -2.836513 -1.010389 0.890582
H  -2.834295 -1.013383 -0.890565
H  3.942796 1.249271 -0.896235
H  3.944082 1.24314 0.9078
H  -3.942046 1.249928 0.89615
H  -3.943247 1.243745 -0.907882
H  5.98398 0.323874 0.002707
H  -5.983521 0.325258 -0.002858
