program: Orca
programVersion: 5.0.2
elementType: S P O O O O N C C C C C C C C C C H H H H H H H H H H H H H H H H H H H H
charge: 0
multiplicity: 1
keywords: wb97x-d3
keywords: def2-TZVPP
keywords: def2/J RIJCOSX
keywords: DEFGRID2
keywords: scfconv7
keywords: smallprint printgap noloewdin
keywords: NOSOSCF
formula: C10H20NO4PS
InChI: InChI=1/C10H20NO4PS/c1-6-11-16(17,13-5)15-9(4)7-10(12)14-8(2)3/h7-8,11H,6H2,1-5H3
37 atoms
S  -1.23393 2.141565 -0.35483
P  -1.856987 0.342991 -0.087512
O  -1.058143 -0.800577 -0.953163
O  3.197944 -0.080269 0.745506
O  -1.659751 -0.308211 1.362766
O  3.229613 -1.500079 -0.980947
N  -3.431297 0.080953 -0.447642
C  4.632642 -0.128343 0.893931
C  -4.184688 0.765363 -1.491251
C  0.269489 -1.081479 -1.030446
C  5.035213 -1.345763 1.702166
C  5.027778 1.169574 1.565799
C  -5.617982 0.999696 -1.060199
C  1.167497 -0.548667 -0.185375
C  2.612625 -0.788726 -0.218042
C  0.504067 -2.029469 -2.151367
C  -2.092795 0.390339 2.532556
H  5.091614 -0.174597 -0.096488
H  -4.157325 0.192005 -2.421615
H  -3.694979 1.718103 -1.690549
H  -3.801624 -0.825799 -0.181679
H  4.75257 -2.277476 1.212203
H  4.584576 -1.326625 2.696136
H  6.118763 -1.358874 1.827449
H  4.583504 1.262799 2.558496
H  4.729548 2.034108 0.971279
H  6.111382 1.207441 1.680913
H  -6.168632 1.511968 -1.849948
H  -6.134611 0.060198 -0.855352
H  -5.663359 1.615681 -0.161365
H  0.843913 0.134677 0.58728
H  0.202818 -1.565808 -3.093507
H  -0.115576 -2.918892 -2.019446
H  1.538697 -2.336536 -2.231839
H  -3.18102 0.388698 2.607705
H  -1.673589 -0.136296 3.387078
H  -1.731966 1.420099 2.537612
elementType: S P O N C H
totalener: -1488.53110117 hartree
nucrepener: 1585.79066151 hartree
electener: -3074.32176269 hartree
oneelecener: -5197.41386899 hartree
twoeener: 2123.09210631 hartree
cpcmener: -0.02549279 hartree
kineticenergy: 1483.73678381 hartree
xcener: -107.352203664705 hartree
chargesum: -0.0000000
charge: -0.455120 0.671120 -0.319161 -0.293584 -0.349389 -0.489985 -0.254008 0.158705 -0.012409 0.289707 -0.263451 -0.251920 -0.245709 -0.266136 0.479132 -0.252644 -0.107413 0.061786 0.092604 0.083044 0.160962 0.094592 0.088704 0.094803 0.087910 0.096551 0.088782 0.086384 0.085465 0.079747 0.086740 0.109462 0.106080 0.108375 0.119002 0.127407 0.103866
qa: -0.4551 0.6711 -0.3192 -0.2936 -0.3494 -0.4900 -0.2540 0.1587 -0.0124 0.2897 -0.2635 -0.2519 -0.2457 -0.2661 0.4791 -0.2526 -0.1074 0.0618 0.0926 0.0830 0.1610 0.0946 0.0887 0.0948 0.0879 0.0966 0.0888 0.0864 0.0855 0.0797 0.0867 0.1095 0.1061 0.1084 0.1190 0.1274 0.1039
va: 1.9834 5.4757 2.1929 2.1274 2.0691 2.0125 3.1533 3.8190 3.8670 3.7158 3.9066 3.9327 3.9345 3.7897 4.2138 3.9427 3.8441 1.0238 0.9951 1.0209 1.0193 1.0170 1.0069 1.0062 1.0071 1.0085 1.0057 1.0083 1.0016 1.0087 1.0682 1.0011 1.0028 1.0351 0.9948 0.9899 1.0049
dispcorr: -0.015467147 hartree
energy: -1488.546568321221
dipole: 3.52254 -5.42696 -1.90443 -2.00395 1.31317 -0.69079 5.55645 -4.60721 0.94925
magnitude: 2.23721 au
magnitude: 5.68653 debye
