program: Orca
programVersion: 5.0.2
elementType: S P O O O O N C C C C C C C C C C H H H H H H H H H H H H H H H H H H H H
charge: 0
multiplicity: 1
keywords: wb97x-d3
keywords: def2-TZVPP
keywords: def2/J RIJCOSX
keywords: DEFGRID2
keywords: scfconv7
keywords: smallprint printgap noloewdin
keywords: NOSOSCF
formula: C10H20NO4PS
InChI: InChI=1/C10H20NO4PS/c1-6-11-16(17,13-5)15-9(4)7-10(12)14-8(2)3/h7-8,11H,6H2,1-5H3
37 atoms
S  -1.560791 -0.528643 2.390704
P  -2.060707 -0.297824 0.548972
O  -1.246152 -1.219255 -0.537607
O  2.960203 0.527684 0.32405
O  -3.468837 -0.905886 0.087715
O  3.047457 -1.133461 -1.17112
N  -2.020296 1.257135 0.044445
C  4.387542 0.731156 0.279436
C  -2.31942 1.729243 -1.302481
C  0.081875 -1.249669 -0.809955
C  4.76988 1.324662 1.618619
C  4.746395 1.638519 -0.8812
C  -1.081815 2.153046 -2.070971
C  0.961685 -0.441709 -0.19463
C  2.407073 -0.420787 -0.429272
C  0.344425 -2.277252 -1.852349
C  -4.655152 -0.532309 0.788128
H  4.882567 -0.23529 0.158812
H  -3.016927 2.565336 -1.224038
H  -2.847232 0.942495 -1.84161
H  -1.567798 1.917739 0.660297
H  5.847814 1.482701 1.655225
H  4.505467 0.65866 2.44093
H  4.285521 2.288502 1.785444
H  4.257916 2.610166 -0.787661
H  4.471469 1.204365 -1.842593
H  5.823961 1.806602 -0.894969
H  -0.536045 2.934914 -1.540115
H  -0.40256 1.316029 -2.231889
H  -1.36258 2.550891 -3.047002
H  0.618127 0.260314 0.552773
H  0.082911 -3.266104 -1.468631
H  1.378514 -2.294192 -2.171591
H  -0.289492 -2.092163 -2.721548
H  -4.918129 0.50911 0.597046
H  -5.452058 -1.173478 0.419289
H  -4.548322 -0.684779 1.863318
elementType: S P O N C H
totalener: -1488.53194986 hartree
nucrepener: 1615.90829727 hartree
electener: -3104.44024713 hartree
oneelecener: -5257.16281013 hartree
twoeener: 2152.72256301 hartree
cpcmener: -0.02651808 hartree
kineticenergy: 1483.75159945 hartree
xcener: -107.356968390125 hartree
chargesum: 0.0000000
charge: -0.447148 0.608925 -0.297836 -0.292992 -0.341837 -0.489447 -0.232727 0.155553 -0.012503 0.289092 -0.251025 -0.262869 -0.259483 -0.291883 0.486892 -0.247233 -0.117306 0.062548 0.094921 0.093734 0.169862 0.088977 0.096654 0.087456 0.088395 0.094768 0.095132 0.087999 0.084487 0.096389 0.086614 0.112473 0.106971 0.106978 0.116605 0.128040 0.104824
qa: -0.4471 0.6089 -0.2978 -0.2930 -0.3418 -0.4894 -0.2327 0.1556 -0.0125 0.2891 -0.2510 -0.2629 -0.2595 -0.2919 0.4869 -0.2472 -0.1173 0.0625 0.0949 0.0937 0.1699 0.0890 0.0967 0.0875 0.0884 0.0948 0.0951 0.0880 0.0845 0.0964 0.0866 0.1125 0.1070 0.1070 0.1166 0.1280 0.1048
va: 2.0041 5.5076 2.1859 2.1279 2.0823 2.0142 3.0582 3.8218 3.8599 3.6696 3.9320 3.9073 3.9424 3.7693 4.1938 3.9416 3.8546 1.0244 0.9973 1.0080 1.0199 1.0057 1.0084 1.0073 1.0071 1.0162 1.0063 1.0027 1.0000 1.0100 1.0764 1.0006 1.0350 1.0025 0.9886 0.9907 1.0047
dispcorr: -0.017206952 hartree
energy: -1488.549156807434
dipole: 12.05564 -13.17109 -1.11545 13.17042 -11.15740 2.01302 -9.97118 8.92540 -1.04578
magnitude: 2.52787 au
magnitude: 6.42534 debye
