program: Orca
programVersion: 5.0.2
elementType: S P O O O O N C C C C C C C C C C H H H H H H H H H H H H H H H H H H H H
charge: 0
multiplicity: 1
keywords: wb97x-d3
keywords: def2-TZVPP
keywords: def2/J RIJCOSX
keywords: DEFGRID2
keywords: scfconv7
keywords: smallprint printgap noloewdin
keywords: NOSOSCF
formula: C10H20NO4PS
InChI: InChI=1/C10H20NO4PS/c1-6-11-16(17,13-5)15-9(4)7-10(12)14-8(2)3/h7-8,11H,6H2,1-5H3
37 atoms
S  -3.68359 -0.387989 1.424091
P  -2.131836 -0.339238 0.292941
O  -0.924025 -1.17138 1.013579
O  3.229415 0.568863 0.120365
O  -2.179159 -1.144618 -1.0951
O  3.067406 -1.521056 -0.658838
N  -1.639298 1.159605 -0.160319
C  4.594167 0.702376 -0.331847
C  -1.740156 2.359115 0.659459
C  0.29736 -1.437524 0.441888
C  5.213473 1.784541 0.526057
C  4.625023 1.047806 -1.808359
C  -2.075741 3.568827 -0.189621
C  1.208552 -0.455897 0.425114
C  2.574769 -0.566177 -0.101314
C  0.420087 -2.849965 0.002245
C  -3.198556 -0.842984 -2.050457
H  5.119291 -0.240321 -0.160124
H  -0.810262 2.528493 1.209506
H  -2.522092 2.196552 1.401011
H  -0.939484 1.202136 -0.891615
H  5.178789 1.526404 1.585221
H  4.710923 2.743401 0.387097
H  6.26035 1.914375 0.252211
H  4.101153 1.985161 -2.004206
H  4.179746 0.267897 -2.425788
H  5.658997 1.170019 -2.13303
H  -3.025153 3.432667 -0.708722
H  -2.155654 4.458221 0.43617
H  -1.30356 3.760319 -0.937281
H  0.943504 0.502338 0.855242
H  1.418856 -3.098195 -0.335794
H  -0.282826 -3.057793 -0.806818
H  0.155417 -3.511608 0.829773
H  -3.145305 -1.608185 -2.821344
H  -4.189018 -0.869656 -1.59289
H  -3.039756 0.135387 -2.505226
elementType: S P O N C H
totalener: -1488.52891683 hartree
nucrepener: 1595.12269517 hartree
electener: -3083.65161200 hartree
oneelecener: -5215.07220227 hartree
twoeener: 2131.42059027 hartree
cpcmener: -0.02687256 hartree
kineticenergy: 1483.74016070 hartree
xcener: -107.350077613107 hartree
chargesum: -0.0000000
charge: -0.451892 0.648154 -0.345309 -0.290896 -0.335807 -0.482008 -0.248285 0.158240 -0.001481 0.251840 -0.251588 -0.264341 -0.247352 -0.294396 0.497447 -0.240968 -0.111028 0.063869 0.083183 0.081994 0.171191 0.096864 0.087993 0.089693 0.088889 0.095793 0.096277 0.080093 0.088024 0.085639 0.137679 0.106742 0.106424 0.108818 0.123738 0.102148 0.114621
qa: -0.4519 0.6482 -0.3453 -0.2909 -0.3358 -0.4820 -0.2483 0.1582 -0.0015 0.2518 -0.2516 -0.2643 -0.2474 -0.2944 0.4974 -0.2410 -0.1110 0.0639 0.0832 0.0820 0.1712 0.0969 0.0880 0.0897 0.0889 0.0958 0.0963 0.0801 0.0880 0.0856 0.1377 0.1067 0.1064 0.1088 0.1237 0.1021 0.1146
va: 2.0069 5.4766 2.1026 2.1351 2.0726 2.0197 3.0869 3.8176 3.8670 3.7139 3.9322 3.9045 3.9313 3.9329 4.1257 3.9441 3.8641 1.0222 0.9967 1.0220 1.0102 1.0083 1.0069 1.0059 1.0068 1.0169 1.0061 1.0087 1.0083 1.0020 1.0186 1.0321 1.0103 1.0019 0.9907 1.0022 0.9934
dispcorr: -0.016313885 hartree
energy: -1488.545230717358
dipole: 17.12522 -15.95821 1.16701 14.98937 -13.19532 1.79405 -10.22757 8.61695 -1.61062
magnitude: 2.67855 au
magnitude: 6.80834 debye
