program: Orca
programVersion: 5.0.2
elementType: S P O O O O N C C C C C C C C C C H H H H H H H H H H H H H H H H H H H H
charge: 0
multiplicity: 1
keywords: wb97x-d3
keywords: def2-TZVPP
keywords: def2/J RIJCOSX
keywords: DEFGRID2
keywords: scfconv7
keywords: smallprint printgap noloewdin
keywords: NOSOSCF
formula: C10H20NO4PS
InChI: InChI=1/C10H20NO4PS/c1-6-11-16(17,13-5)15-9(4)7-10(12)14-8(2)3/h7-8,11H,6H2,1-5H3
37 atoms
S  -1.214765 2.458133 -1.028521
P  -1.801883 0.711724 -0.475321
O  -1.065557 -0.569274 -1.181468
O  3.206703 0.130416 0.466735
O  -1.523113 0.30039 1.051848
O  2.976124 -1.934315 -0.362587
N  -3.372653 0.413167 -0.790358
C  4.566168 -0.116267 0.883952
C  -4.11513 -0.774754 -0.387997
C  0.175139 -1.086803 -0.962162
C  4.578266 -0.829964 2.222423
C  5.23772 1.238996 0.946747
C  -5.105431 -0.494774 0.726117
C  1.164172 -0.354496 -0.427187
C  2.514857 -0.838437 -0.128157
C  0.206097 -2.501934 -1.415034
C  -1.764088 1.256518 2.086336
H  5.064444 -0.732009 0.131409
H  -3.411684 -1.547089 -0.075893
H  -4.631378 -1.171823 -1.263724
H  -3.879965 1.122429 -1.298417
H  4.108175 -1.811959 2.170606
H  4.068325 -0.241717 2.987521
H  5.608717 -0.978489 2.54789
H  6.277613 1.118675 1.250924
H  4.752227 1.894672 1.671893
H  5.232858 1.734332 -0.024869
H  -5.673277 -1.39561 0.963204
H  -4.597183 -0.169502 1.634855
H  -5.817404 0.280088 0.437969
H  0.985245 0.683198 -0.176061
H  -0.109255 -2.563091 -2.458648
H  -0.50376 -3.091548 -0.830506
H  1.187753 -2.949049 -1.323846
H  -1.048499 2.077296 2.03125
H  -2.776603 1.660849 2.038609
H  -1.636448 0.734132 3.031804
elementType: S P O N C H
totalener: -1488.53171259 hartree
nucrepener: 1600.76513412 hartree
electener: -3089.29684671 hartree
oneelecener: -5227.15860353 hartree
twoeener: 2137.86175682 hartree
cpcmener: -0.02569893 hartree
kineticenergy: 1483.73887669 hartree
xcener: -107.353523094876 hartree
chargesum: 0.0000000
charge: -0.454173 0.600258 -0.315364 -0.291835 -0.336801 -0.489299 -0.228006 0.157106 -0.010031 0.290406 -0.262930 -0.252933 -0.251618 -0.275327 0.484568 -0.253589 -0.117175 0.062939 0.085675 0.092953 0.169472 0.094545 0.089118 0.095009 0.088649 0.088409 0.096862 0.090146 0.080240 0.085528 0.095344 0.107818 0.109151 0.108568 0.118944 0.114887 0.132485
qa: -0.4542 0.6003 -0.3154 -0.2918 -0.3368 -0.4893 -0.2280 0.1571 -0.0100 0.2904 -0.2629 -0.2529 -0.2516 -0.2753 0.4846 -0.2536 -0.1172 0.0629 0.0857 0.0930 0.1695 0.0945 0.0891 0.0950 0.0886 0.0884 0.0969 0.0901 0.0802 0.0855 0.0953 0.1078 0.1092 0.1086 0.1189 0.1149 0.1325
va: 2.0009 5.5207 2.1545 2.1304 2.0235 2.0135 3.1246 3.8212 3.8797 3.7057 3.9047 3.9338 3.9361 3.7928 4.2074 3.9419 3.8345 1.0233 1.0096 0.9982 1.0212 1.0171 1.0069 1.0061 1.0057 1.0071 1.0081 1.0095 1.0026 1.0022 1.0680 1.0025 0.9997 1.0352 1.0046 0.9914 0.9897
dispcorr: -0.016483290 hartree
energy: -1488.548195876986
dipole: 4.15310 -5.97341 -1.82032 -6.64330 6.18218 -0.46112 13.25807 -11.98176 1.27631
magnitude: 2.27049 au
magnitude: 5.77114 debye
