program: Orca
programVersion: 5.0.2
elementType: S P O O O O N C C C C C C C C C C H H H H H H H H H H H H H H H H H H H H
charge: 0
multiplicity: 1
keywords: wb97x-d3
keywords: def2-TZVPP
keywords: def2/J RIJCOSX
keywords: DEFGRID2
keywords: scfconv7
keywords: smallprint printgap noloewdin
keywords: NOSOSCF
formula: C10H20NO4PS
InChI: InChI=1/C10H20NO4PS/c1-6-11-16(17,13-5)15-9(4)7-10(12)14-8(2)3/h7-8,11H,6H2,1-5H3
37 atoms
S  -3.303193 -0.165844 2.197526
P  -2.246813 -0.149467 0.592224
O  -1.075233 -1.291814 0.7218
O  3.114351 0.473923 0.250544
O  -2.984472 -0.547732 -0.778731
O  2.733324 -1.041607 -1.352424
N  -1.542968 1.279763 0.214214
C  4.406082 0.826754 -0.286626
C  -1.082551 1.711267 -1.103051
C  0.058754 -1.337033 -0.052546
C  5.201647 1.386226 0.872988
C  4.240402 1.83036 -1.412023
C  0.021276 2.740672 -0.967355
C  1.085107 -0.566809 0.328135
C  2.370392 -0.439683 -0.366434
C  -0.037394 -2.300118 -1.177738
C  -3.761257 -1.743559 -0.86381
H  4.89635 -0.074853 -0.6616
H  -1.911947 2.12659 -1.682257
H  -0.710774 0.849968 -1.657459
H  -1.747331 2.024918 0.865618
H  4.730598 2.279238 1.28789
H  6.199905 1.66296 0.534072
H  5.315073 0.652814 1.672306
H  3.645814 1.433137 -2.234939
H  5.219062 2.094531 -1.814333
H  3.767878 2.747396 -1.055385
H  0.343178 3.078112 -1.952792
H  -0.319957 3.617606 -0.413774
H  0.889332 2.330049 -0.45051
H  0.95835 0.052803 1.206448
H  -0.808275 -1.983242 -1.884058
H  -0.334564 -3.279314 -0.796605
H  0.897694 -2.407807 -1.714303
H  -4.255125 -1.730498 -1.832418
H  -3.137635 -2.635387 -0.79402
H  -4.519243 -1.774403 -0.079455
elementType: S P O N C H
totalener: -1488.52795234 hartree
nucrepener: 1628.24579957 hartree
electener: -3116.77375190 hartree
oneelecener: -5281.26815418 hartree
twoeener: 2164.49440228 hartree
cpcmener: -0.02611938 hartree
kineticenergy: 1483.73206389 hartree
xcener: -107.349670688722 hartree
chargesum: -0.0000000
charge: -0.450749 0.607466 -0.331539 -0.288909 -0.331010 -0.481264 -0.245490 0.159459 -0.030064 0.247032 -0.252114 -0.278086 -0.257684 -0.269473 0.492308 -0.257424 -0.119251 0.067795 0.106203 0.108020 0.163723 0.088150 0.089079 0.096359 0.097791 0.105233 0.089534 0.092848 0.094297 0.068289 0.124252 0.105758 0.118175 0.114002 0.127317 0.119578 0.110387
qa: -0.4507 0.6075 -0.3315 -0.2889 -0.3310 -0.4813 -0.2455 0.1595 -0.0301 0.2470 -0.2521 -0.2781 -0.2577 -0.2695 0.4923 -0.2574 -0.1193 0.0678 0.1062 0.1080 0.1637 0.0881 0.0891 0.0964 0.0978 0.1052 0.0895 0.0928 0.0943 0.0683 0.1243 0.1058 0.1182 0.1140 0.1273 0.1196 0.1104
va: 2.0219 5.5223 2.0678 2.1250 2.0587 2.0193 3.0484 3.8128 3.8640 3.7002 3.9361 3.9028 3.9380 3.8798 4.1093 3.9485 3.8437 1.0235 1.0015 0.9914 1.0221 1.0065 1.0058 1.0085 1.0149 1.0078 1.0038 1.0072 1.0016 1.0154 1.0338 0.9991 0.9989 1.0373 0.9894 0.9843 1.0075
dispcorr: -0.018931811 hartree
energy: -1488.546884148701
dipole: 19.99776 -19.25897 0.73879 10.11232 -9.17092 0.94141 -13.18941 11.58925 -1.60017
magnitude: 1.99815 au
magnitude: 5.07889 debye
