program: Orca
programVersion: 5.0.2
elementType: S P O O O O N C C C C C C C C C C H H H H H H H H H H H H H H H H H H H H
charge: 0
multiplicity: 1
keywords: wb97x-d3
keywords: def2-TZVPP
keywords: def2/J RIJCOSX
keywords: DEFGRID2
keywords: scfconv7
keywords: smallprint printgap noloewdin
keywords: NOSOSCF
formula: C10H20NO4PS
InChI: InChI=1/C10H20NO4PS/c1-6-11-16(17,13-5)15-9(4)7-10(12)14-8(2)3/h7-8,11H,6H2,1-5H3
37 atoms
S  -1.077314 2.480399 -0.077617
P  -1.799651 0.702725 -0.186935
O  -1.03802 -0.318102 -1.219112
O  3.102076 -0.377899 0.870157
O  -1.710918 -0.217806 1.123809
O  3.142858 -1.487339 -1.070906
N  -3.353917 0.647984 -0.686395
C  4.494474 -0.651432 1.133193
C  -4.113104 -0.57136 -0.944546
C  0.257044 -0.729558 -1.253007
C  4.659296 -0.576308 2.63625
C  5.369387 0.348806 0.403358
C  -5.576957 -0.374755 -0.606878
C  1.13508 -0.420293 -0.284814
C  2.540605 -0.832376 -0.24825
C  0.486045 -1.524519 -2.487667
C  -2.240163 0.261195 2.361345
H  4.729194 -1.663578 0.795273
H  -3.700897 -1.377255 -0.337291
H  -4.004968 -0.873971 -1.989422
H  -3.683448 1.475329 -1.1651
H  5.693921 -0.79296 2.90279
H  4.027919 -1.306091 3.144715
H  4.417004 0.416869 3.018728
H  5.249812 0.288613 -0.678345
H  6.418075 0.149729 0.627518
H  5.148652 1.370053 0.719241
H  -6.013834 0.43818 -1.18977
H  -6.140094 -1.280666 -0.83287
H  -5.712567 -0.145718 0.450467
H  0.822587 0.181294 0.557317
H  -0.221659 -2.354901 -2.531462
H  1.491542 -1.920255 -2.549454
H  0.302288 -0.90043 -3.36517
H  -1.943967 -0.4510 3.127715
H  -1.835697 1.242694 2.61322
H  -3.328858 0.319103 2.327614
elementType: S P O N C H
totalener: -1488.53290572 hartree
nucrepener: 1591.15335764 hartree
electener: -3079.68626336 hartree
oneelecener: -5208.00255163 hartree
twoeener: 2128.31628827 hartree
cpcmener: -0.02556132 hartree
kineticenergy: 1483.74432921 hartree
xcener: -107.352997630054 hartree
chargesum: -0.0000000
charge: -0.447784 0.605931 -0.301504 -0.293367 -0.338996 -0.489851 -0.242959 0.157850 -0.023378 0.294177 -0.252990 -0.262624 -0.249878 -0.264633 0.476922 -0.254479 -0.101460 0.062171 0.098049 0.092798 0.165643 0.088814 0.096242 0.088607 0.094279 0.094876 0.089291 0.086273 0.087444 0.081842 0.087737 0.107467 0.107779 0.109571 0.127984 0.106970 0.115189
qa: -0.4478 0.6059 -0.3015 -0.2934 -0.3390 -0.4899 -0.2430 0.1579 -0.0234 0.2942 -0.2530 -0.2626 -0.2499 -0.2646 0.4769 -0.2545 -0.1015 0.0622 0.0980 0.0928 0.1656 0.0888 0.0962 0.0886 0.0943 0.0949 0.0893 0.0863 0.0874 0.0818 0.0877 0.1075 0.1078 0.1096 0.1280 0.1070 0.1152
va: 2.0071 5.5203 2.1700 2.1282 2.0456 2.0127 3.1167 3.8199 3.8783 3.7124 3.9325 3.9073 3.9546 3.7876 4.2222 3.9405 3.8337 1.0234 1.0041 0.9981 1.0203 1.0057 1.0082 1.0069 1.0167 1.0060 1.0068 1.0004 1.0076 1.0050 1.0668 1.0020 1.0356 1.0009 0.9901 1.0076 0.9917
dispcorr: -0.015969810 hartree
energy: -1488.548875532691
dipole: 2.98734 -5.02492 -2.03758 -7.71444 6.86707 -0.84738 5.99393 -5.29915 0.69478
magnitude: 2.31355 au
magnitude: 5.88057 debye
