program: Orca
programVersion: 5.0.2
elementType: S P O O O O N C C C C C C C C C C H H H H H H H H H H H H H H H H H H H H
charge: 0
multiplicity: 1
keywords: wb97x-d3
keywords: def2-TZVPP
keywords: def2/J RIJCOSX
keywords: DEFGRID2
keywords: scfconv7
keywords: smallprint printgap noloewdin
keywords: NOSOSCF
formula: C10H20NO4PS
InChI: InChI=1/C10H20NO4PS/c1-6-11-16(17,13-5)15-9(4)7-10(12)14-8(2)3/h7-8,11H,6H2,1-5H3
37 atoms
S  -3.097599 -2.218985 0.936225
P  -2.396424 -0.63425 0.095496
O  -0.841738 -0.651969 -0.408673
O  3.548902 0.415119 -0.749326
O  -2.942658 -0.354392 -1.385858
O  3.122338 -0.366496 1.30226
N  -2.606353 0.724988 0.995046
C  4.952169 0.593262 -0.45831
C  -1.91194 2.002897 0.825808
C  0.30227 -0.618786 0.332884
C  5.178312 1.913214 0.252671
C  5.670709 0.526306 -1.78898
C  -2.014933 2.593359 -0.566823
C  1.378056 -0.169589 -0.335083
C  2.740639 -0.070152 0.190625
C  0.224989 -1.110537 1.732286
C  -4.353256 -0.333673 -1.602711
H  5.290928 -0.229966 0.175035
H  -0.859597 1.917053 1.114587
H  -2.371974 2.687215 1.538231
H  -2.946369 0.548068 1.929351
H  4.852309 2.753543 -0.362867
H  6.242621 2.041214 0.453993
H  4.657042 1.962653 1.208499
H  6.745162 0.618578 -1.629026
H  5.36236 1.333944 -2.455386
H  5.493349 -0.424643 -2.292848
H  -3.052639 2.677241 -0.891141
H  -1.586848 3.596066 -0.557216
H  -1.46372 2.018634 -1.310393
H  1.238418 0.146043 -1.361925
H  -0.435146 -0.481976 2.334416
H  1.200055 -1.118061 2.203466
H  -0.183422 -2.121597 1.75474
H  -4.858058 0.360366 -0.928061
H  -4.507024 -0.002564 -2.627118
H  -4.78274 -1.32867 -1.479167
elementType: S P O N C H
totalener: -1488.52748735 hartree
nucrepener: 1592.53487289 hartree
electener: -3081.06236024 hartree
oneelecener: -5210.16390321 hartree
twoeener: 2129.10154297 hartree
cpcmener: -0.02587828 hartree
kineticenergy: 1483.72854026 hartree
xcener: -107.352519509747 hartree
chargesum: 0.0000000
charge: -0.453057 0.608664 -0.291415 -0.295000 -0.337764 -0.492262 -0.243370 0.160451 -0.031510 0.207774 -0.265184 -0.250734 -0.253728 -0.279359 0.504976 -0.246414 -0.124965 0.062502 0.087675 0.103944 0.175796 0.089262 0.095503 0.094601 0.089486 0.088009 0.095860 0.085752 0.100281 0.085691 0.125299 0.109856 0.118101 0.115931 0.112701 0.130499 0.116148
qa: -0.4531 0.6087 -0.2914 -0.2950 -0.3378 -0.4923 -0.2434 0.1605 -0.0315 0.2078 -0.2652 -0.2507 -0.2537 -0.2794 0.5050 -0.2464 -0.1250 0.0625 0.0877 0.1039 0.1758 0.0893 0.0955 0.0946 0.0895 0.0880 0.0959 0.0858 0.1003 0.0857 0.1253 0.1099 0.1181 0.1159 0.1127 0.1305 0.1161
va: 2.0112 5.5097 2.1476 2.1298 2.0690 2.0077 3.0579 3.8170 3.8917 3.7487 3.9083 3.9308 3.9056 3.8467 4.1247 3.8923 3.8425 1.0236 0.9936 0.9937 1.0167 1.0067 1.0062 1.0167 1.0055 1.0071 1.0087 1.0055 1.0075 1.0097 1.0327 1.0058 1.0423 1.0104 0.9963 0.9904 1.0034
dispcorr: -0.017307589 hartree
energy: -1488.544794940086
dipole: 15.65356 -15.97339 -0.31983 17.47364 -15.10882 2.36482 -3.54491 3.29479 -0.25011
magnitude: 2.39942 au
magnitude: 6.09883 debye
