program: Orca
programVersion: 5.0.2
elementType: S P O O O O N C C C C C C C C C C H H H H H H H H H H H H H H H H H H H H
charge: 0
multiplicity: 1
keywords: wb97x-d3
keywords: def2-TZVPP
keywords: def2/J RIJCOSX
keywords: DEFGRID2
keywords: scfconv7
keywords: smallprint printgap noloewdin
keywords: NOSOSCF
formula: C10H20NO4PS
InChI: InChI=1/C10H20NO4PS/c1-6-11-16(17,13-5)15-9(4)7-10(12)14-8(2)3/h7-8,11H,6H2,1-5H3
37 atoms
S  -1.860832 -0.15073 2.382983
P  -2.063559 -0.271436 0.476174
O  -0.875677 -1.069584 -0.33003
O  3.218923 -0.147352 -0.330682
O  -3.187314 -1.268579 -0.0799
O  2.705178 1.848541 0.536832
N  -2.302151 1.175848 -0.252511
C  4.634708 0.139797 -0.335069
C  -2.325445 1.399988 -1.694618
C  0.44557 -0.777159 -0.413582
C  5.238539 -0.748836 -1.401142
C  5.220598 -0.124028 1.038003
C  -3.281661 2.520778 -2.049625
C  0.964464 0.3445 0.116773
C  2.366525 0.757644 0.126792
C  1.158941 -1.860376 -1.156975
C  -4.536288 -1.104549 0.362816
H  4.785568 1.186499 -0.60877
H  -2.636385 0.479494 -2.188735
H  -1.320856 1.63314 -2.057686
H  -2.091146 1.988747 0.310504
H  4.813933 -0.541197 -2.384188
H  5.089817 -1.806379 -1.175525
H  6.312126 -0.569033 -1.461878
H  5.074284 -1.164107 1.335346
H  4.784428 0.518072 1.803024
H  6.2937 0.070543 1.021957
H  -3.256833 2.709801 -3.123247
H  -4.306625 2.272787 -1.772633
H  -3.008949 3.450134 -1.546027
H  0.324014 1.057657 0.61792
H  1.804316 -1.461488 -1.935744
H  0.438941 -2.530376 -1.622901
H  1.779797 -2.453478 -0.484576
H  -5.099421 -1.948084 -0.028515
H  -4.601397 -1.10975 1.451971
H  -4.969877 -0.178874 -0.018348
elementType: S P O N C H
totalener: -1488.52934597 hartree
nucrepener: 1602.49056004 hartree
electener: -3091.01990601 hartree
oneelecener: -5230.15575935 hartree
twoeener: 2139.13585335 hartree
cpcmener: -0.02873533 hartree
kineticenergy: 1483.74236827 hartree
xcener: -107.352308847617 hartree
chargesum: -0.0000000
charge: -0.444144 0.615882 -0.292371 -0.286736 -0.342133 -0.494950 -0.235714 0.150169 -0.018364 0.286460 -0.263751 -0.260411 -0.252441 -0.282308 0.450109 -0.219974 -0.116665 0.067023 0.101563 0.091968 0.169432 0.098000 0.089755 0.097236 0.089118 0.094513 0.096182 0.088567 0.083059 0.086869 0.086893 0.101543 0.106931 0.109655 0.128491 0.105988 0.114556
qa: -0.4441 0.6159 -0.2924 -0.2867 -0.3421 -0.4949 -0.2357 0.1502 -0.0184 0.2865 -0.2638 -0.2604 -0.2524 -0.2823 0.4501 -0.2200 -0.1167 0.0670 0.1016 0.0920 0.1694 0.0980 0.0898 0.0972 0.0891 0.0945 0.0962 0.0886 0.0831 0.0869 0.0869 0.1015 0.1069 0.1097 0.1285 0.1060 0.1146
va: 2.0113 5.4957 2.1814 2.1191 2.0820 2.0050 3.0473 3.8198 3.8590 3.7087 3.9278 3.9092 3.9604 3.8441 4.2397 3.9235 3.8553 1.0238 1.0022 0.9977 1.0191 1.0070 1.0057 1.0070 1.0062 1.0183 1.0065 1.0070 1.0045 1.0004 1.0691 1.0077 1.0164 1.0048 0.9907 1.0044 0.9897
dispcorr: -0.017159617 hartree
energy: -1488.546505586849
dipole: 11.30068 -11.93937 -0.63869 1.67025 -2.02957 -0.35933 -13.85530 11.41409 -2.44121
magnitude: 2.54883 au
magnitude: 6.47862 debye
