program: Orca
programVersion: 5.0.2
elementType: S P O O O O N C C C C C C C C C C H H H H H H H H H H H H H H H H H H H H
charge: 0
multiplicity: 1
keywords: wb97x-d3
keywords: def2-TZVPP
keywords: def2/J RIJCOSX
keywords: DEFGRID2
keywords: scfconv7
keywords: smallprint printgap noloewdin
keywords: NOSOSCF
formula: C10H20NO4PS
InChI: InChI=1/C10H20NO4PS/c1-6-11-16(17,13-5)15-9(4)7-10(12)14-8(2)3/h7-8,11H,6H2,1-5H3
37 atoms
S  -3.191873 -2.054889 0.455414
P  -2.313966 -0.356193 0.212612
O  -0.991941 -0.04891 1.112909
O  3.265376 0.672853 -0.369949
O  -1.640445 -0.135466 -1.227397
O  3.044226 -1.426144 0.375878
N  -3.28429 0.923975 0.542072
C  4.66801 0.490352 -0.656595
C  -2.854223 2.304758 0.76597
C  0.23039 -0.655037 0.947671
C  5.482286 0.688746 0.607318
C  5.014906 1.496529 -1.732918
C  -2.14341 2.928936 -0.418728
C  1.185926 0.08956 0.379718
C  2.5706 -0.334582 0.151244
C  0.305023 -2.038888 1.48087
C  -2.412318 -0.340698 -2.409868
H  4.824038 -0.519384 -1.043933
H  -2.229501 2.381089 1.660142
H  -3.763257 2.868154 0.974171
H  -4.146402 0.665256 0.999564
H  6.542449 0.563748 0.384166
H  5.223746 -0.034056 1.381155
H  5.341602 1.69281 1.011682
H  4.867904 2.522074 -1.38931
H  4.416613 1.34359 -2.63211
H  6.062831 1.385645 -2.012043
H  -2.746704 2.859728 -1.324512
H  -1.964374 3.984978 -0.214419
H  -1.1738 2.47212 -0.614115
H  0.933835 1.094466 0.063487
H  -0.160542 -2.73907 0.782578
H  -0.246696 -2.108185 2.41833
H  1.327112 -2.358621 1.647021
H  -3.315054 0.273055 -2.413053
H  -1.78563 -0.050207 -3.250376
H  -2.692429 -1.389386 -2.51781
elementType: S P O N C H
totalener: -1488.52810915 hartree
nucrepener: 1602.32140601 hartree
electener: -3090.84951517 hartree
oneelecener: -5230.15276634 hartree
twoeener: 2139.30325117 hartree
cpcmener: -0.02405383 hartree
kineticenergy: 1483.74675716 hartree
xcener: -107.351876553577 hartree
chargesum: 0.0000000
charge: -0.459414 0.615023 -0.336640 -0.293025 -0.318301 -0.482247 -0.253213 0.157625 -0.023365 0.263462 -0.261737 -0.250807 -0.257831 -0.290120 0.496468 -0.238901 -0.113990 0.063675 0.088151 0.095793 0.170691 0.095354 0.094126 0.089102 0.088165 0.096148 0.089862 0.085731 0.099237 0.079746 0.130489 0.105384 0.108929 0.113250 0.111230 0.127373 0.114579
qa: -0.4594 0.6150 -0.3366 -0.2930 -0.3183 -0.4822 -0.2532 0.1576 -0.0234 0.2635 -0.2617 -0.2508 -0.2578 -0.2901 0.4965 -0.2389 -0.1140 0.0637 0.0882 0.0958 0.1707 0.0954 0.0941 0.0891 0.0882 0.0961 0.0899 0.0857 0.0992 0.0797 0.1305 0.1054 0.1089 0.1132 0.1112 0.1274 0.1146
va: 2.0111 5.5230 2.0924 2.1352 2.0421 2.0182 3.0939 3.8187 3.9003 3.7122 3.9084 3.9323 3.9166 3.9300 4.1370 3.9237 3.8375 1.0231 0.9992 0.9939 1.0186 1.0061 1.0170 1.0069 1.0070 1.0084 1.0056 1.0059 1.0096 1.0054 1.0215 1.0125 1.0083 1.0302 0.9958 0.9900 1.0051
dispcorr: -0.017035196 hartree
energy: -1488.545144350544
dipole: 16.63118 -16.85480 -0.22362 14.88584 -12.41411 2.47173 -6.56842 5.87306 -0.69536
magnitude: 2.57739 au
magnitude: 6.55122 debye
