program: Orca
programVersion: 5.0.2
elementType: S P O O O O N C C C C C C C C C C H H H H H H H H H H H H H H H H H H H H
charge: 0
multiplicity: 1
keywords: wb97x-d3
keywords: def2-TZVPP
keywords: def2/J RIJCOSX
keywords: DEFGRID2
keywords: scfconv7
keywords: smallprint printgap noloewdin
keywords: NOSOSCF
formula: C10H20NO4PS
InChI: InChI=1/C10H20NO4PS/c1-6-11-16(17,13-5)15-9(4)7-10(12)14-8(2)3/h7-8,11H,6H2,1-5H3
37 atoms
S  -2.494613 -2.041271 -1.119005
P  -2.152105 -0.354622 -0.251532
O  -1.113132 -0.375893 1.001149
O  3.263112 0.710358 0.162129
O  -1.40617 0.736421 -1.160554
O  3.080473 -1.447447 0.725848
N  -3.488912 0.354628 0.385337
C  4.692174 0.607163 -0.016524
C  -3.501025 1.438051 1.372134
C  0.168988 -0.874814 0.95822
C  5.243191 2.004258 0.171186
C  5.002881 0.042889 -1.389581
C  -2.79149 2.698959 0.91887
C  1.144134 -0.03674 0.588234
C  2.571869 -0.369564 0.514023
C  0.245502 -2.283565 1.416626
C  -1.943912 1.081528 -2.436465
H  5.099834 -0.048702 0.756038
H  -3.08942 1.102597 2.328227
H  -4.552057 1.665498 1.547799
H  -4.272858 -0.278014 0.46045
H  6.328728 1.983114 0.076303
H  5.005686 2.39973 1.159473
H  4.855771 2.694309 -0.580468
H  6.083331 -0.004033 -1.529949
H  4.590735 0.676913 -2.176736
H  4.612708 -0.966381 -1.519778
H  -3.173669 3.050244 -0.040091
H  -2.961478 3.486067 1.653968
H  -1.713467 2.56826 0.835411
H  0.87933 0.979196 0.325107
H  -0.268249 -2.932249 0.703037
H  -0.275299 -2.386261 2.37065
H  1.264069 -2.6322 1.534205
H  -1.269803 1.813747 -2.873874
H  -1.998424 0.210531 -3.090482
H  -2.937344 1.522143 -2.343981
elementType: S P O N C H
totalener: -1488.52855216 hartree
nucrepener: 1603.78011942 hartree
electener: -3092.30867158 hartree
oneelecener: -5233.20338360 hartree
twoeener: 2140.89471202 hartree
cpcmener: -0.02363667 hartree
kineticenergy: 1483.74626650 hartree
xcener: -107.351651794104 hartree
chargesum: 0.0000000
charge: -0.461509 0.635891 -0.338965 -0.292409 -0.327330 -0.481513 -0.256780 0.158326 -0.021424 0.242925 -0.252405 -0.263473 -0.257982 -0.273550 0.496811 -0.227640 -0.107709 0.063834 0.087271 0.095766 0.168993 0.089702 0.096719 0.088118 0.095183 0.089801 0.095506 0.082487 0.099378 0.083370 0.126123 0.099717 0.109448 0.108533 0.126156 0.111654 0.110979
qa: -0.4615 0.6359 -0.3390 -0.2924 -0.3273 -0.4815 -0.2568 0.1583 -0.0214 0.2429 -0.2524 -0.2635 -0.2580 -0.2735 0.4968 -0.2276 -0.1077 0.0638 0.0873 0.0958 0.1690 0.0897 0.0967 0.0881 0.0952 0.0898 0.0955 0.0825 0.0994 0.0834 0.1261 0.0997 0.1094 0.1085 0.1262 0.1117 0.1110
va: 2.0111 5.5066 2.0885 2.1362 2.0517 2.0199 3.0863 3.8174 3.8978 3.7027 3.9318 3.9069 3.9197 3.9345 4.1339 3.9464 3.8366 1.0229 0.9988 0.9934 1.0187 1.0056 1.0083 1.0069 1.0060 1.0068 1.0166 1.0050 1.0091 1.0053 1.0321 1.0175 1.0020 1.0332 0.9898 1.0061 0.9958
dispcorr: -0.016786449 hartree
energy: -1488.545338608256
dipole: 12.97078 -13.70949 -0.73871 15.03744 -12.68329 2.35416 0.00727 0.34196 0.34922
magnitude: 2.49193 au
magnitude: 6.33397 debye
