program: Gaussian 09
title: 000066353
version: EM64L-G09RevD.01
frameworkgroup: C1[X(C9H12O)]
method: RPBEPBE
basis: SDD
operation: Freq
keyword: #pfreq=noraman
keyword: PBEPBE/SDD
title: #p freq=noraman PBEPBE/SDD
converged: YES YES NO NO
title: Mulliken charges:
elementType: O C C C C C C C C C H H H H H H H H H H H H
charge: -0.275066 0.528005 -0.527084 -0.542718 -0.426329 0.345767 -0.674649 -0.214838 -0.380081 -0.537443 0.209572 0.207157 0.253873 0.231216 0.222077 0.214930 0.224402 0.218869 0.240134 0.219828 0.219517 0.242860
chargesum: 0.00000
title: Mulliken charges with hydrogens summed into heavy atoms:
elementType: O C C C C C C C C C
charge: -0.275066 0.528005 -0.110356 -0.288846 -0.195112 0.345767 -0.013239 0.004031 -0.139947 0.144763
polarizability: 1.36819621e+02 2.24266288e+00 1.01896288e+02 -4.92966724e+00 3.86298032e+00 5.91915097e+01
1716.lowfreq: -0.0005 0.0003 0.0005 6.9037 10.3706 17.7879 37.4026 83.9670 140.6188
frequency: 37.0666 83.9594 140.6092 193.3177 203.6410 240.8176 265.9482 305.3563 329.8787 440.4456 456.6949 510.3694 553.0079 618.1458 698.8733 709.1286 782.6395 789.3805 855.6664 873.5147 892.2604 963.5245 971.3161 983.8003 1008.5053 1056.6908 1064.9632 1099.8715 1112.3875 1145.3744 1164.2803 1185.4052 1240.4401 1253.1779 1300.6327 1312.8235 1389.4304 1389.6955 1432.2524 1449.0190 1466.9128 1471.5560 1472.4720 1475.9407 1479.7473 1490.0565 1588.9917 1621.3057 2957.2012 2979.1747 2987.2754 3038.5985 3043.5570 3077.4944 3084.1553 3120.4781 3122.3645 3141.0120 3145.1367 3165.5914
redmass: 2.4797 3.0804 3.2620 1.5992 1.7944 1.6276 1.6397 3.3442 2.3056 3.7488 3.1788 4.1921 4.6517 4.0695 2.3162 3.4928 1.4586 1.2320 3.7221 1.3923 1.5126 1.3270 2.8801 4.8810 2.8317 1.8202 1.8232 1.5044 1.2603 1.5213 1.4009 1.2268 1.3522 2.6923 1.2776 1.5646 1.9407 2.2566 1.3247 2.1361 1.0505 1.2790 1.0780 1.0952 1.6300 1.1100 6.1446 6.6807 1.0330 1.0350 1.0599 1.1017 1.1038 1.1000 1.1012 1.0865 1.0990 1.0929 1.0923 1.0961
irintensity: 0.1068 8.2525 0.0180 1.6826 0.5690 2.0644 0.6966 0.1989 0.5073 1.2456 5.5881 0.6343 9.1042 0.3267 24.6927 13.4498 39.3902 12.0112 10.1076 1.1945 23.0275 0.4835 21.4689 0.3947 44.0206 27.1787 4.8363 4.6160 0.2535 20.2196 46.0975 4.5038 3.9875 102.8378 1.0974 5.7755 9.1614 7.3463 25.5847 30.3035 12.8022 8.0517 23.1486 11.9847 34.0301 13.4690 55.8007 84.5764 68.4533 40.6840 35.3040 8.8819 52.0893 58.4385 41.8216 5.8415 27.2784 28.6123 3.7375 14.8664
temp: 298.150 k
press: 1.00000 atm
elementType: 8 6 6 6 6 6 6 6 6 6 1 1 1 1 1 1 1 1 1 1 1 1
symmnumber: 1
zpe: 487079.5 jmol-1
zpe.correction: 0.185519 hartree
zpe.thermalcorrener: 0.195618 hartree
zpe.thermalcorrenthalpy: 0.196562 hartree
zpe.thermalcorrgfe: 0.149671 hartree
zpe.sumelectzpe: -424.612339 hartree
zpe.sumelectthermal: -424.602240 hartree
zpe.sumelectthermalent: -424.601296 hartree
zpe.sumelectthermalfe: -424.648188 hartree
dipole: -0.8806 0.8284 0.3092
dipole: 1.2479
quadrupole: -47.1623 -58.6905 -64.0225
quadrupole: -1.9556 -2.1719 0.8052
quadrupole: 9.4628 -2.0654 -7.3974 -1.9556 -2.1719 0.8052
hfenergy: -424.7978583 hartree
pointgroup: C01 [X(C9H12O1)]
dipole: 0.3451196 0.3253552 -0.1268763 debye
dipolederiv: -1.4822093 0.393394 0.0624751 0.5984178 -0.5397331 -0.0276682 0.0523157 -0.0105958 -0.3063061 0.3771205 0.0425506 -0.0102984 0.0980312 0.201195 -0.0280962 -0.0257703 -0.0283534 -0.0763242 0.0193749 -0.0615928 -0.0291915 -0.0467474 0.1301456 -0.0125047 -0.1500418 -0.0519332 0.1070484 -0.4895996 0.1444504 -0.0110669 -0.0144528 0.0043818 -0.0328652 0.0340838 -0.0449999 -0.1849396 -0.2049196 -0.1315255 0.0007409 -0.1554113 -0.174223 0.0000928 0.0239611 0.0076653 -0.2064375 1.0912913 -0.4818981 -0.0278531 -0.8102369 0.4968719 0.0255268 0.0023357 -0.0017718 0.1174704 -0.0027264 -0.0283535 -0.0392786 -0.0299627 0.0606191 -0.0170684 0.0548395 0.0162773 0.0014329 0.2089234 0.0499782 -0.0478752 -0.0552674 0.1424815 -0.0289014 -0.0385132 -0.0480312 -0.1172837 -0.1891575 -0.0033979 -0.0184709 0.3385513 -0.2633214 -0.037516 -0.0576711 0.0043604 -0.2282388 0.8341914 -0.0845985 -0.0402019 0.203618 0.1947138 -0.0009589 -0.0921983 0.0306848 0.334289 0.029193 0.0309482 -0.045505 -0.0348157 -0.0880587 0.1313981 -0.0027601 0.0930676 -0.0207073 -0.048589 0.0342182 0.0720462 0.0878062 -0.0311816 -0.1192311 0.0661969 -0.0662364 -0.0122738 0.1058803 -0.0237342 0.0182128 -0.0173306 -0.0627331 0.0366102 0.0154563 0.0377784 0.1481004 -0.0667257 0.1101331 0.0169701 0.0964891 0.0301271 0.0127136 0.0192626 0.0093195 0.1512071 0.1051614 0.0025855 -0.0203351 0.0450959 -0.080574 0.1293886 -0.0224648 0.0796194 -0.0083489 -0.2150201 -0.1327261 0.006929 -0.1407911 0.0464819 0.0018628 0.0016898 0.0019599 0.0612602 0.0327352 0.1130364 0.0770772 0.0720796 -0.0115986 -0.1016727 0.036754 -0.0731289 -0.0023112 0.0714608 -0.0230395 0.0121666 -0.0194215 -0.1333712 0.0413583 0.0142304 0.0443578 0.1433427 -0.0842286 -0.0647674 0.0401454 -0.0675078 0.0777192 0.0220293 0.0428686 0.0233085 0.1651192 -0.0315191 -0.0030086 -0.0094213 -0.1740656 -0.0122722 -0.1193843 -0.0460894 -0.1068519 -0.0531846 -0.0157164 0.0190219 -0.0107813 -0.1259682 0.0515104 0.1178067 0.0744647 0.0709052 -0.1330263 -0.044921 0.0983256 0.0035159 0.1518899 -0.0391804 0.0070802 -0.0029501 0.0125983 0.1201117 unknown
polarizability: 136.8857198|-2.1194124|101.6924237|-4.5237691|-4.779093|59.3292745 unknown
InChI: InChI=1S/C9H12O/c1-3-8-5-4-6-9(7-8)10-2/h4-7H,3H2,1-2H3
charge 0 multiplicity 1
22 atoms
O  2.234616 -1.162563 0.061506
C  -1.259076 0.018688 0.316485
C  -2.637584 -0.58965 0.538667
C  -0.107781 -0.798087 0.298382
C  -1.112489 1.414493 0.084061
C  1.171621 -0.241543 0.050417
C  -3.355799 -0.924366 -0.796561
C  0.161814 1.964634 -0.161105
C  1.317555 1.147885 -0.181922
C  3.58143 -0.641126 -0.176835
H  -2.548872 -1.513174 1.141674
H  -3.266961 0.112812 1.118521
H  -0.178583 -1.876511 0.47882
H  -1.996552 2.062889 0.102701
H  -3.483259 -0.016621 -1.413858
H  -4.355631 -1.357765 -0.609391
H  -2.768557 -1.651075 -1.386486
H  0.267237 3.04189 -0.33445
H  2.297539 1.59591 -0.371359
H  3.87332 0.093903 0.598799
H  3.662806 -0.173572 -1.177796
H  4.243208 -1.51825 -0.123269
