program: Orca
programVersion: 5.0.2
elementType: S P O O O O N C C C C C C C C C C H H H H H H H H H H H H H H H H H H H H
charge: 0
multiplicity: 1
keywords: wb97x-d3
keywords: def2-TZVPP
keywords: def2/J RIJCOSX
keywords: DEFGRID2
keywords: scfconv7
keywords: smallprint printgap noloewdin
keywords: NOSOSCF
formula: C10H20NO4PS
InChI: InChI=1/C10H20NO4PS/c1-6-11-16(17,13-5)15-9(4)7-10(12)14-8(2)3/h7-8,11H,6H2,1-5H3
37 atoms
S  -1.904335 0.101244 2.087118
P  -2.221685 -0.169996 0.210568
O  -1.314505 -1.352302 -0.487894
O  2.816485 0.634623 0.213397
O  -3.653668 -0.771062 -0.180048
O  3.026943 -1.456636 -0.550324
N  -2.023081 1.125563 -0.763361
C  4.245598 0.832611 0.243098
C  -2.023848 2.522969 -0.353879
C  0.036945 -1.470498 -0.551887
C  4.503062 1.896249 1.288826
C  4.741848 1.24006 -1.130666
C  -0.872497 3.283057 -0.980381
C  0.862032 -0.484865 -0.160548
C  2.325551 -0.532178 -0.201269
C  0.391173 -2.804534 -1.103971
C  -4.135665 -1.979891 0.411447
H  4.728467 -0.098225 0.549651
H  -1.949685 2.557622 0.732122
H  -2.975464 2.988053 -0.621961
H  -2.1210 0.96671 -1.759378
H  4.130957 1.593572 2.268372
H  4.037741 2.8464 1.020457
H  5.576054 2.064935 1.381244
H  5.818508 1.410366 -1.096144
H  4.267647 2.165852 -1.461367
H  4.55692 0.470647 -1.880227
H  -0.900592 4.328176 -0.670224
H  0.08886 2.865666 -0.678589
H  -0.924778 3.261574 -2.070286
H  0.451642 0.438499 0.22358
H  0.035447 -3.588046 -0.431084
H  1.457394 -2.928593 -1.24326
H  -0.107965 -2.954789 -2.063183
H  -5.19384 -2.04947 0.171745
H  -3.620636 -2.849935 0.003045
H  -4.017861 -1.96723 1.496088
elementType: S P O N C H
totalener: -1488.53077179 hartree
nucrepener: 1611.19720360 hartree
electener: -3099.72797539 hartree
oneelecener: -5247.93636009 hartree
twoeener: 2148.20838469 hartree
cpcmener: -0.02482264 hartree
kineticenergy: 1483.74316213 hartree
xcener: -107.355457431503 hartree
chargesum: -0.0000000
charge: -0.453097 0.675650 -0.319726 -0.295121 -0.355283 -0.489676 -0.247115 0.155602 -0.012300 0.292121 -0.252938 -0.263404 -0.241226 -0.266576 0.478531 -0.255716 -0.112057 0.065305 0.086145 0.095942 0.157505 0.096040 0.088207 0.089835 0.095161 0.089197 0.094111 0.089145 0.075370 0.085995 0.082625 0.109847 0.108882 0.106410 0.126310 0.119411 0.100887
qa: -0.4531 0.6756 -0.3197 -0.2951 -0.3553 -0.4897 -0.2471 0.1556 -0.0123 0.2921 -0.2529 -0.2634 -0.2412 -0.2666 0.4785 -0.2557 -0.1121 0.0653 0.0861 0.0959 0.1575 0.0960 0.0882 0.0898 0.0952 0.0892 0.0941 0.0891 0.0754 0.0860 0.0826 0.1098 0.1089 0.1064 0.1263 0.1194 0.1009
va: 1.9799 5.4704 2.1737 2.1212 2.1084 2.0133 3.1046 3.8149 3.8448 3.7220 3.9349 3.9116 3.9291 3.7914 4.2088 3.9423 3.8526 1.0245 1.0273 0.9974 1.0232 1.0085 1.0062 1.0055 1.0063 1.0060 1.0164 1.0098 1.0097 1.0019 1.0603 1.0005 1.0352 1.0029 0.9893 0.9914 1.0045
dispcorr: -0.016427899 hartree
energy: -1488.547199688866
dipole: 15.17620 -15.92616 -0.74996 10.39273 -9.68268 0.71006 -6.65389 5.18404 -1.46985
magnitude: 1.79640 au
magnitude: 4.56610 debye
