program: Orca
programVersion: 5.0.2
elementType: S P O O O O N C C C C C C C C C C H H H H H H H H H H H H H H H H H H H H
charge: 0
multiplicity: 1
keywords: wb97x-d3
keywords: def2-TZVPP
keywords: def2/J RIJCOSX
keywords: DEFGRID2
keywords: scfconv7
keywords: smallprint printgap noloewdin
keywords: NOSOSCF
formula: C10H20NO4PS
InChI: InChI=1/C10H20NO4PS/c1-6-11-16(17,13-5)15-9(4)7-10(12)14-8(2)3/h7-8,11H,6H2,1-5H3
37 atoms
S  -1.341266 0.842183 1.624739
P  -2.013226 0.041344 0.008736
O  -0.885712 -0.279191 -1.131049
O  3.401937 0.274968 0.338936
O  -2.637474 -1.431224 0.147167
O  3.086119 -1.847007 -0.301061
N  -3.15618 0.89965 -0.791911
C  4.780809 0.04681 0.693602
C  -3.181743 2.352664 -0.894534
C  0.295295 -0.945349 -0.904844
C  5.123074 1.097422 1.728471
C  5.653256 0.143719 -0.542964
C  -4.606072 2.868266 -0.927503
C  1.319251 -0.223203 -0.437718
C  2.668928 -0.720474 -0.148503
C  0.239404 -2.379672 -1.281939
C  -3.64404 -1.686472 1.12859
H  4.876384 -0.946505 1.138923
H  -2.638203 2.685713 -1.78302
H  -2.657688 2.760741 -0.030595
H  -3.627218 0.413386 -1.546681
H  6.154656 0.970196 2.05627
H  4.483606 1.014224 2.608236
H  5.023328 2.106045 1.323169
H  5.404685 -0.617797 -1.282246
H  6.698833 0.003335 -0.266469
H  5.5603 1.124511 -1.012982
H  -4.611102 3.95521 -1.013699
H  -5.156515 2.468056 -1.780909
H  -5.143685 2.597268 -0.018283
H  1.15172 0.827164 -0.23875
H  1.211824 -2.856034 -1.243458
H  -0.161074 -2.481769 -2.29256
H  -0.435373 -2.920814 -0.614824
H  -3.32535 -1.359197 2.11945
H  -4.580026 -1.189306 0.869834
H  -3.803827 -2.762171 1.145854
elementType: S P O N C H
totalener: -1488.52933064 hartree
nucrepener: 1581.15473652 hartree
electener: -3069.68406716 hartree
oneelecener: -5188.24136073 hartree
twoeener: 2118.55729356 hartree
cpcmener: -0.02494442 hartree
kineticenergy: 1483.75127441 hartree
xcener: -107.351611848006 hartree
chargesum: -0.0000000
charge: -0.464057 0.700597 -0.360755 -0.287928 -0.352484 -0.484559 -0.256011 0.154608 -0.009799 0.264200 -0.249466 -0.261792 -0.247650 -0.286212 0.505799 -0.236648 -0.111506 0.063702 0.092349 0.082410 0.160540 0.088962 0.096430 0.087789 0.094533 0.094984 0.089252 0.086752 0.085529 0.079946 0.115670 0.107569 0.108509 0.104384 0.102333 0.117110 0.124912
qa: -0.4641 0.7006 -0.3608 -0.2879 -0.3525 -0.4846 -0.2560 0.1546 -0.0098 0.2642 -0.2495 -0.2618 -0.2476 -0.2862 0.5058 -0.2366 -0.1115 0.0637 0.0923 0.0824 0.1605 0.0890 0.0964 0.0878 0.0945 0.0950 0.0893 0.0868 0.0855 0.0799 0.1157 0.1076 0.1085 0.1044 0.1023 0.1171 0.1249
va: 1.9782 5.4626 2.1006 2.1350 2.0923 2.0181 3.1210 3.8227 3.8643 3.6874 3.9309 3.9090 3.9365 3.9319 4.1242 3.9545 3.8569 1.0225 0.9956 1.0207 1.0195 1.0057 1.0085 1.0073 1.0163 1.0062 1.0069 1.0082 1.0015 1.0085 1.0431 1.0330 1.0028 1.0087 1.0032 0.9941 0.9902
dispcorr: -0.015600480 hartree
energy: -1488.544931120828
dipole: 5.62106 -7.24818 -1.62713 5.27478 -4.93515 0.33964 -2.15107 1.14004 -1.01102
magnitude: 1.94552 au
magnitude: 4.94513 debye
