program: Orca
programVersion: 5.0.2
elementType: S P O O O O N C C C C C C C C C C H H H H H H H H H H H H H H H H H H H H
charge: 0
multiplicity: 1
keywords: wb97x-d3
keywords: def2-TZVPP
keywords: def2/J RIJCOSX
keywords: DEFGRID2
keywords: scfconv7
keywords: smallprint printgap noloewdin
keywords: NOSOSCF
formula: C10H20NO4PS
InChI: InChI=1/C10H20NO4PS/c1-6-11-16(17,13-5)15-9(4)7-10(12)14-8(2)3/h7-8,11H,6H2,1-5H3
37 atoms
S  -1.788623 0.822888 1.760144
P  -2.036248 -0.081836 0.077882
O  -0.857042 0.186767 -1.019322
O  3.25904 -0.1836 0.015098
O  -1.98031 -1.684822 0.106352
O  3.003571 -2.340405 -0.513619
N  -3.432062 0.257891 -0.712102
C  4.675835 -0.340608 0.261689
C  -4.08268 1.562273 -0.704941
C  0.48773 0.218107 -0.713942
C  4.903978 -0.897838 1.652711
C  5.286272 1.032536 0.081714
C  -3.458763 2.573627 -1.648496
C  1.125611 -0.956038 -0.631081
C  2.546124 -1.226151 -0.376234
C  0.988229 1.611085 -0.597682
C  -2.774401 -2.405649 1.05117
H  5.090745 -1.02169 -0.484917
H  -4.073358 1.940136 0.317458
H  -5.128703 1.397655 -0.965554
H  -3.617007 -0.303742 -1.535596
H  4.469905 -1.889566 1.776716
H  4.4847 -0.238136 2.414487
H  5.975169 -0.984172 1.839094
H  4.882639 1.750063 0.798403
H  5.120141 1.416592 -0.925503
H  6.363567 0.975259 0.238593
H  -4.038092 3.498066 -1.647649
H  -2.438904 2.821579 -1.350678
H  -3.43222 2.199033 -2.672968
H  0.552015 -1.856865 -0.808407
H  0.585733 2.209927 -1.416365
H  2.068125 1.686689 -0.613403
H  0.620353 2.053473 0.331831
H  -3.839069 -2.224551 0.896809
H  -2.567658 -3.46158 0.893953
H  -2.508657 -2.138164 2.074417
elementType: S P O N C H
totalener: -1488.52820576 hartree
nucrepener: 1605.38413065 hartree
electener: -3093.91233641 hartree
oneelecener: -5236.40411984 hartree
twoeener: 2142.49178343 hartree
cpcmener: -0.02598393 hartree
kineticenergy: 1483.74046923 hartree
xcener: -107.349843110593 hartree
chargesum: -0.0000000
charge: -0.467501 0.707462 -0.351008 -0.291084 -0.350151 -0.486712 -0.267522 0.158119 -0.018282 0.213702 -0.260960 -0.268128 -0.235792 -0.255099 0.488731 -0.220107 -0.114964 0.066572 0.085247 0.092927 0.162011 0.094736 0.089352 0.096275 0.090627 0.098379 0.100578 0.090333 0.073552 0.082176 0.129088 0.109846 0.107098 0.101661 0.116608 0.126317 0.105915
qa: -0.4675 0.7075 -0.3510 -0.2911 -0.3502 -0.4867 -0.2675 0.1581 -0.0183 0.2137 -0.2610 -0.2681 -0.2358 -0.2551 0.4887 -0.2201 -0.1150 0.0666 0.0852 0.0929 0.1620 0.0947 0.0894 0.0963 0.0906 0.0984 0.1006 0.0903 0.0736 0.0822 0.1291 0.1098 0.1071 0.1017 0.1166 0.1263 0.1059
va: 1.9667 5.4531 2.0881 2.1297 2.0929 2.0094 3.1312 3.8191 3.8891 3.7490 3.9062 3.9222 3.9038 3.9705 4.1410 3.9476 3.8576 1.0227 1.0216 0.9972 1.0219 1.0191 1.0066 1.0063 1.0059 1.0065 1.0067 1.0106 1.0089 1.0062 1.0332 1.0027 1.0231 1.0162 0.9937 0.9906 1.0007
dispcorr: -0.016945158 hartree
energy: -1488.545150918295
dipole: 9.21476 -10.32795 -1.11318 8.28736 -7.39259 0.89477 -1.30959 0.36120 -0.94839
magnitude: 1.71442 au
magnitude: 4.35770 debye
