program: Orca
programVersion: 5.0.2
elementType: S P O O O O N C C C C C C C C C C H H H H H H H H H H H H H H H H H H H H
charge: 0
multiplicity: 1
keywords: wb97x-d3
keywords: def2-TZVPP
keywords: def2/J RIJCOSX
keywords: DEFGRID2
keywords: scfconv7
keywords: smallprint printgap noloewdin
keywords: NOSOSCF
formula: C10H20NO4PS
InChI: InChI=1/C10H20NO4PS/c1-6-11-16(17,13-5)15-9(4)7-10(12)14-8(2)3/h7-8,11H,6H2,1-5H3
37 atoms
S  -1.300665 1.280441 1.396613
P  -1.98904 0.124899 0.020828
O  -0.911166 -0.363065 -1.105252
O  3.474706 0.314107 0.095513
O  -2.501777 -1.321773 0.492254
O  3.068495 -1.854074 -0.269097
N  -3.233296 0.737253 -0.853096
C  4.863236 0.060231 0.406785
C  -3.400791 2.143443 -1.198901
C  0.293417 -0.98193 -0.872184
C  5.000023 -0.42617 1.836371
C  5.594395 1.363611 0.170763
C  -4.860897 2.546502 -1.15893
C  1.322988 -0.221406 -0.480623
C  2.683671 -0.706918 -0.218242
C  0.248095 -2.4337 -1.180257
C  -3.468058 -1.419799 1.540212
H  5.246206 -0.69721 -0.28113
H  -2.979734 2.344774 -2.187339
H  -2.830999 2.737525 -0.485103
H  -3.683906 0.09175 -1.49129
H  6.054521 -0.577161 2.070686
H  4.49039 -1.374999 2.002064
H  4.603319 0.306671 2.541395
H  5.235251 2.153644 0.83249
H  5.490837 1.702458 -0.86089
H  6.657632 1.224145 0.366283
H  -4.967904 3.597357 -1.429913
H  -5.457944 1.963917 -1.862681
H  -5.280423 2.408898 -0.161737
H  1.155601 0.838755 -0.341398
H  1.229231 -2.892461 -1.185393
H  -0.21488 -2.586748 -2.157143
H  -0.372115 -2.955641 -0.447704
H  -3.653028 -2.479152 1.700418
H  -3.094156 -0.97935 2.465378
H  -4.404311 -0.933111 1.264136
elementType: S P O N C H
totalener: -1488.52929878 hartree
nucrepener: 1579.88244947 hartree
electener: -3068.41174825 hartree
oneelecener: -5185.71421592 hartree
twoeener: 2117.30246766 hartree
cpcmener: -0.02462740 hartree
kineticenergy: 1483.73897417 hartree
xcener: -107.350155860070 hartree
chargesum: 0.0000000
charge: -0.463121 0.698445 -0.359537 -0.291223 -0.349587 -0.485340 -0.257869 0.158965 -0.008133 0.266113 -0.264224 -0.251464 -0.246369 -0.283593 0.501959 -0.242533 -0.113431 0.063245 0.093192 0.081164 0.160374 0.095030 0.095630 0.089668 0.088435 0.096399 0.088954 0.086924 0.084894 0.079479 0.120198 0.108759 0.107389 0.105810 0.125304 0.104263 0.115832
qa: -0.4631 0.6984 -0.3595 -0.2912 -0.3496 -0.4853 -0.2579 0.1590 -0.0081 0.2661 -0.2642 -0.2515 -0.2464 -0.2836 0.5020 -0.2425 -0.1134 0.0632 0.0932 0.0812 0.1604 0.0950 0.0956 0.0897 0.0884 0.0964 0.0890 0.0869 0.0849 0.0795 0.1202 0.1088 0.1074 0.1058 0.1253 0.1043 0.1158
va: 1.9801 5.4654 2.1073 2.1370 2.0893 2.0154 3.1219 3.8166 3.8606 3.6909 3.9030 3.9328 3.9337 3.9292 4.1290 3.9537 3.8596 1.0224 0.9959 1.0231 1.0196 1.0060 1.0178 1.0069 1.0070 1.0084 1.0056 1.0084 1.0019 1.0085 1.0422 1.0317 1.0033 1.0077 0.9908 1.0007 0.9949
dispcorr: -0.015547640 hartree
energy: -1488.544846418680
dipole: 4.60426 -6.25646 -1.65220 3.03689 -3.03517 0.00171 -0.21493 -0.71407 -0.92900
magnitude: 1.89547 au
magnitude: 4.81791 debye
