program: Gaussian 09
title: 000066349
version: EM64L-G09RevD.01
frameworkgroup: C1[X(C8H8O4)]
method: RPBEPBE
basis: SDD
operation: Freq
keyword: #p
keyword: freq=noraman
keyword: PBEPBE/SDD
title: #p freq=noraman PBEPBE/SDD
converged: NO NO NO NO
title: Mulliken charges:
elementType: O O O O C C C C C C C C H H H H H H H H
charge: -0.242465 -0.254927 -0.245212 -0.194606 0.367400 -0.404806 -0.360107 0.262653 -0.303174 0.301963 -0.187248 -0.743716 0.250342 0.259629 0.268839 0.284362 0.188453 0.250536 0.253694 0.248390
chargesum: 0.00000
title: Mulliken charges with hydrogens summed into heavy atoms:
elementType: O O O O C C C C C C C C
charge: -0.242465 -0.254927 -0.245212 -0.194606 0.367400 0.105166 -0.091268 0.262653 -0.018812 0.301963 0.001205 0.008904
polarizability: 1.61298586e+02 -1.22639027e+01 8.72690561e+01 7.25105648e+00 7.02981742e+00 6.88715992e+01
1716.lowfreq: -71.3501 -13.6321 -6.5554 -2.9256 0.0006 0.0007 0.0008 12.1208 34.0236
frequency: -71.1907 11.4362 33.9588 61.2782 137.8516 148.2576 183.2672 203.2685 251.8355 297.3538 317.6263 428.1786 474.6218 564.4431 583.8582 618.7807 647.1957 724.0117 741.7922 817.9673 849.6329 903.5678 905.2906 909.4659 941.1788 966.8143 974.7383 988.9463 1026.4714 1041.7615 1157.5533 1178.8133 1192.4005 1213.6461 1259.0244 1343.6388 1353.6695 1383.5827 1386.5121 1450.4232 1452.3105 1452.7316 1531.9575 1581.9170 1597.6038 1655.7611 2924.3647 3010.7875 3032.1411 3098.2104 3098.5068 3147.4071 3227.0413 3247.0802
redmass: 1.0338 7.2371 4.8638 5.9348 5.9235 5.9562 3.3514 8.0568 2.7346 3.4467 3.1250 3.7114 6.9965 3.0362 5.7873 3.9663 5.2169 5.2603 4.8281 1.4737 3.5095 2.6919 2.3237 2.4346 5.0931 3.2315 1.7403 1.9399 1.2435 1.6615 2.3002 1.8448 3.2847 1.6585 2.1604 1.5253 2.4530 1.2537 1.5774 1.0925 1.0469 1.0615 8.9027 6.6723 6.5418 9.4817 1.0855 1.0368 1.0580 1.0991 1.1050 1.1010 1.0948 1.1042
irintensity: 1.2535 1.8530 1.7253 1.0658 2.9093 9.3829 1.2890 11.8879 17.3393 3.8646 10.3339 3.7981 2.9300 2.6316 7.5100 1.9771 0.4048 15.1753 44.2891 71.3854 15.4665 80.6263 57.6647 6.8858 31.7666 5.8848 5.0864 78.9253 31.3756 9.1445 14.4274 16.6410 432.2007 35.7889 14.0023 20.6575 10.6652 47.9077 17.6782 7.4702 19.1995 27.6523 105.5970 17.7446 266.5107 226.8394 77.7529 1.6321 11.0769 1.4389 10.7048 10.0364 0.7307 1.1658
temp: 298.150 k
press: 1.00000 atm
elementType: 8 8 8 8 6 6 6 6 6 6 6 6 1 1 1 1 1 1 1 1
symmnumber: 1
zpe: 381201.6 jmol-1
zpe.correction: 0.145192 hartree
zpe.thermalcorrener: 0.156424 hartree
zpe.thermalcorrenthalpy: 0.157369 hartree
zpe.thermalcorrgfe: 0.104937 hartree
zpe.sumelectzpe: -609.630089 hartree
zpe.sumelectthermal: -609.618857 hartree
zpe.sumelectthermalent: -609.617913 hartree
zpe.sumelectthermalfe: -609.670344 hartree
dipole: -2.5259 1.3304 1.3112
dipole: 3.1416
quadrupole: -91.8614 -62.3891 -68.7470
quadrupole: 9.9551 -8.7924 2.8128
quadrupole: -17.5289 11.9434 5.5855 9.9551 -8.7924 2.8128
hfenergy: -609.7752813 hartree
pointgroup: C01 [X(C8H8O4)]
dipole: 0.9922884 -0.5787908 0.4560936 debye
dipolederiv: -0.1261283 -0.1247061 0.0936681 -0.1529464 -0.4682049 0.1966046 0.0808685 0.2060238 -0.2235715 -1.8996663 -0.2666318 0.0441204 -0.4406835 -0.3773387 -0.0697208 -0.0659552 -0.0989617 -0.427573 -0.9106796 -0.0674964 0.0809286 0.1104104 -0.3964215 -0.2184968 0.4846551 -0.1443408 -0.7458673 -1.2344516 0.3642927 0.0393866 0.0646487 -0.434537 0.0377801 0.2401738 -0.0597941 -0.36098 0.1583731 0.0316311 -0.0502764 0.3316055 0.1974811 -0.1829901 -0.0198841 -0.1161724 0.0349305 0.9879814 0.1090141 0.0273143 0.2864631 0.3471083 0.0370912 0.2944187 0.0879509 0.3240626 -0.4091252 0.006963 0.0396386 -0.1681513 0.0064718 -0.0432914 0.1253397 -0.1010361 -0.1579946 -0.4188192 0.3383916 -0.1012414 0.8640101 -0.3791947 -0.0219922 -0.2768881 0.0911112 0.0597811 0.2091748 -0.0645259 -0.0670093 -0.2585888 0.0646709 -0.0138631 0.0122232 -0.0690436 -0.0996291 2.0525498 0.3233854 -0.0907129 0.170708 0.4435626 0.3885457 -0.5670895 0.3072164 0.9580938 1.5007322 -0.5256719 -0.084432 -0.6389088 0.9165788 -0.2302779 -0.1089125 -0.2058674 0.2620219 -0.1568457 -0.0675225 -0.0726262 -0.1171423 -0.0920209 -0.164557 -0.129194 -0.1768531 -0.2424351 -0.0144105 0.0288941 -0.0005684 -0.0304627 -0.0682192 -0.0381925 -0.0890343 -0.0113458 0.0742732 -0.0100525 -0.0160036 0.0059892 -0.0734936 0.0375135 0.0735822 -0.0925129 0.0121455 -0.0219839 0.1022632 0.0768849 -0.0030829 0.0736988 0.0419585 0.0505116 -0.0019524 0.0497991 0.1638451 0.05623 -0.0293295 0.0504362 -0.0128885 0.1293385 0.0337269 0.0512078 0.0343977 0.1603822 0.0353321 -0.1132589 0.0796005 -0.0128092 -0.1219639 0.1202384 0.0310429 0.14165 0.0417259 0.1112497 -0.0482659 0.0111313 -0.0140807 0.0626402 0.0992786 0.0017759 0.0681794 -0.0124687 0.0624761 0.0885258 -0.017748 0.0576873 -0.0214678 -0.0346255 -0.0065604 -0.0045878 0.1262082 -0.0961834 -0.0445701 0.0154838 -0.0390763 0.1120443 -0.019352 0.0362777 -0.0104713 0.0871785 unknown
polarizability: 161.4350078|-11.1601369|88.6182776|-8.1094748|-4.7574001|67.385956 unknown
InChI: InChI=1S/C8H8O4/c1-6(10)11-5-8-3-2-7(4-9)12-8/h2-4H,5H2,1H3
charge 0 multiplicity 1
20 atoms
O  -1.007039 0.413255 -0.541163
O  1.989546 0.122508 0.359699
O  3.878625 -0.118814 -0.985851
O  -4.512454 1.009213 0.212302
C  -0.195949 -0.697518 -0.260856
C  1.219395 -0.624029 -0.698244
C  -0.94566 -1.666786 0.404411
C  -2.295122 0.117854 -0.02652
C  -2.275072 -1.152025 0.555846
C  3.353432 0.309193 0.064763
C  -3.325203 1.136331 -0.201492
C  4.027429 1.083537 1.17399
H  1.658583 -1.629563 -0.807669
H  1.33083 -0.083064 -1.653449
H  -0.572762 -2.630805 0.744411
H  -3.129159 -1.633093 1.027103
H  -2.9761 2.06014 -0.720483
H  3.931908 0.54024 2.129797
H  3.536548 2.063136 1.305354
H  5.089522 1.22839 0.93215
