program: Orca
programVersion: 5.0.2
elementType: S P O O O O N C C C C C C C C C C H H H H H H H H H H H H H H H H H H H H
charge: 0
multiplicity: 1
keywords: wb97x-d3
keywords: def2-TZVPP
keywords: def2/J RIJCOSX
keywords: DEFGRID2
keywords: scfconv7
keywords: smallprint printgap noloewdin
keywords: NOSOSCF
formula: C10H20NO4PS
InChI: InChI=1/C10H20NO4PS/c1-6-11-16(17,13-5)15-9(4)7-10(12)14-8(2)3/h7-8,11H,6H2,1-5H3
37 atoms
S  -1.417069 1.345913 1.407883
P  -2.145451 -0.003752 0.247238
O  -1.091447 -1.135956 -0.279745
O  3.321067 -0.448083 0.742778
O  -3.218044 -0.993254 0.913214
O  3.012792 -0.449546 -1.472944
N  -2.843448 0.540306 -1.134791
C  4.73079 -0.163893 0.60737
C  -3.616747 1.773776 -1.232432
C  0.141994 -0.869358 -0.820341
C  5.390888 -0.678658 1.868223
C  4.940389 1.325467 0.41153
C  -3.481942 2.386409 -2.611343
C  1.171482 -0.776605 0.029076
C  2.570166 -0.542981 -0.349781
C  0.116985 -0.768365 -2.301062
C  -2.954942 -1.635718 2.161983
H  5.122414 -0.710342 -0.253751
H  -3.243626 2.466388 -0.478704
H  -4.66957 1.589173 -1.002072
H  -3.119008 -0.179009 -1.79479
H  6.465848 -0.505645 1.812861
H  5.235531 -1.750898 1.994168
H  5.016473 -0.16718 2.756764
H  6.0070 1.537082 0.327688
H  4.552774 1.8918 1.260312
H  4.462491 1.694052 -0.496103
H  -4.066289 3.30485 -2.673496
H  -2.442433 2.62949 -2.834012
H  -3.847747 1.710719 -3.386663
H  0.971147 -0.874253 1.088497
H  1.108682 -0.739277 -2.73541
H  -0.419207 0.134784 -2.603351
H  -0.4268 -1.617644 -2.719194
H  -2.204672 -2.42039 2.052477
H  -2.619102 -0.919896 2.914087
H  -3.890181 -2.08294 2.491844
elementType: S P O N C H
totalener: -1488.52947084 hartree
nucrepener: 1588.21052074 hartree
electener: -3076.73999158 hartree
oneelecener: -5202.14457274 hartree
twoeener: 2125.40458116 hartree
cpcmener: -0.02461112 hartree
kineticenergy: 1483.74433543 hartree
xcener: -107.350708758121 hartree
chargesum: -0.0000000
charge: -0.467165 0.707699 -0.356761 -0.291011 -0.353019 -0.483441 -0.261599 0.158394 -0.016007 0.262409 -0.250272 -0.262246 -0.250245 -0.285719 0.504318 -0.243559 -0.111950 0.063342 0.082041 0.091093 0.160794 0.089001 0.096153 0.088409 0.094747 0.089911 0.094244 0.090370 0.080363 0.086283 0.119111 0.111780 0.102063 0.111199 0.120373 0.101306 0.127592
qa: -0.4672 0.7077 -0.3568 -0.2910 -0.3530 -0.4834 -0.2616 0.1584 -0.0160 0.2624 -0.2503 -0.2622 -0.2502 -0.2857 0.5043 -0.2436 -0.1120 0.0633 0.0820 0.0911 0.1608 0.0890 0.0962 0.0884 0.0947 0.0899 0.0942 0.0904 0.0804 0.0863 0.1191 0.1118 0.1021 0.1112 0.1204 0.1013 0.1276
va: 1.9745 5.4623 2.0895 2.1369 2.0872 2.0176 3.1471 3.8174 3.8763 3.6936 3.9320 3.9085 3.9307 3.9419 4.1272 3.9582 3.8465 1.0234 1.0208 0.9945 1.0178 1.0056 1.0082 1.0070 1.0063 1.0067 1.0167 1.0088 1.0071 1.0015 1.0381 1.0353 1.0083 1.0033 0.9902 1.0059 0.9892
dispcorr: -0.016000204 hartree
energy: -1488.545471041997
dipole: 9.66650 -10.72086 -1.05436 4.10794 -4.86058 -0.75264 -4.54932 4.10723 -0.44209
magnitude: 1.36879 au
magnitude: 3.47918 debye
