program: Gaussian 09
title: 000066348
version: EM64L-G09RevD.01
frameworkgroup: C1[X(S8)]
method: RPBEPBE
basis: SDD
operation: Freq
keyword: #p
keyword: freq=noraman
keyword: PBEPBE/SDD
title: #p freq=noraman PBEPBE/SDD
converged: YES YES NO NO
title: Mulliken charges:
elementType: S S S S S S S S
charge: 0.000016 -0.000005 -0.000025 0.000007 0.000019 -0.000014 -0.000011 0.000012
chargesum: 0.00000
title: Mulliken charges with hydrogens summed into heavy atoms:
polarizability: 2.09103085e+02 3.40148946e-04 2.08912171e+02 -2.51708770e-03 2.60004307e-03 8.46975752e+01
1716.lowfreq: -0.0022 -0.0013 0.0025 8.8190 12.9443 13.2170 59.3970 62.0018 104.1892
frequency: 59.3969 62.0018 104.1892 105.2573 146.1178 146.1783 162.5971 170.6914 185.3007 185.5094 229.6177 308.3873 308.4748 381.4502 381.4587 381.4894 382.7412 385.6475
redmass: 31.9721 31.9721 31.9721 31.9721 31.9721 31.9721 31.9721 31.9721 31.9721 31.9721 31.9721 31.9721 31.9721 31.9721 31.9721 31.9721 31.9721 31.9721
irintensity: 0.0000 0.0000 0.0000 0.0000 2.8663 2.8832 0.0086 2.0230 0.0012 0.0009 0.0005 0.0001 0.0001 1.6866 1.3420 0.8051 0.0002 0.0000
temp: 298.150 k
press: 1.00000 atm
elementType: 16 16 16 16 16 16 16 16
symmnumber: 1
zpe: 24442.7 jmol-1
zpe.correction: 0.009310 hartree
zpe.thermalcorrener: 0.021886 hartree
zpe.thermalcorrenthalpy: 0.022830 hartree
zpe.thermalcorrgfe: -0.032022 hartree
zpe.sumelectzpe: -3183.873497 hartree
zpe.sumelectthermal: -3183.860921 hartree
zpe.sumelectthermalent: -3183.859977 hartree
zpe.sumelectthermalfe: -3183.914829 hartree
dipole: 0.0000 0.0000 -0.0032
dipole: 0.0032
quadrupole: -106.4459 -106.4526 -107.3568
quadrupole: -0.0001 -0.0001 0.0000
quadrupole: 0.3059 0.2992 -0.6051 -0.0001 -0.0001 0.0000
hfenergy: -3183.8828069 hartree
pointgroup: C01 [X(S8)]
dipole: 0.0000021 0.0000004 -0.0012659 debye
dipolederiv: 0.1397142 -0.0026748 -0.0011131 -0.0028272 -0.1404123 -0.0910291 -0.0002449 -0.001188 -0.0003373 0.0036256 0.1401038 -0.0638922 0.1403452 -0.0021777 0.0653909 -0.0009551 0.0007281 0.0003677 -0.002801 -0.1403698 0.0655413 -0.1400391 0.0030072 0.0639312 0.0012563 0.0013182 0.0003101 -0.1405413 0.0029768 0.0910722 0.0025491 0.1395067 -0.0007758 0.0013622 0.0002063 -0.0003578 -0.1405438 0.0029877 -0.0910609 0.0025116 0.1396487 0.0007769 -0.0013307 -0.0002101 -0.0003262 -0.0027655 -0.1404726 -0.0655446 -0.140067 0.0030996 -0.0639223 -0.001256 -0.0012951 0.0003386 0.0036388 0.1399939 0.0638902 0.1403797 -0.0022571 -0.0653999 0.0009463 -0.0007523 0.0003495 0.139673 -0.002545 0.0011073 -0.0028524 -0.1404152 0.0910281 0.0002221 0.0011929 -0.0003447 unknown
polarizability: 209.0309806|0.0925573|208.9842752|-0.0035826|0.0005106|84.6975752 unknown
InChI: InChI=1S/S8/c1-2-4-6-8-7-5-3-1
charge 0 multiplicity 1
8 atoms
S  0.02678 2.604379 -0.5525
S  -1.820618 1.858552 0.553292
S  1.860684 1.822724 0.551247
S  -2.605086 0.02678 -0.551931
S  2.605031 -0.026769 -0.552126
S  -1.860615 -1.822711 0.551366
S  1.820704 -1.858498 0.553159
S  -0.026881 -2.604358 -0.552508
