program: Orca
programVersion: 5.0.2
elementType: S P O O O O N C C C C C C C C C C H H H H H H H H H H H H H H H H H H H H
charge: 0
multiplicity: 1
keywords: wb97x-d3
keywords: def2-TZVPP
keywords: def2/J RIJCOSX
keywords: DEFGRID2
keywords: scfconv7
keywords: smallprint printgap noloewdin
keywords: NOSOSCF
formula: C10H20NO4PS
InChI: InChI=1/C10H20NO4PS/c1-6-11-16(17,13-5)15-9(4)7-10(12)14-8(2)3/h7-8,11H,6H2,1-5H3
37 atoms
S  -2.106002 -0.675263 2.19143
P  -2.114003 -0.075897 0.364534
O  -0.853205 0.864615 -0.096996
O  3.258332 0.02023 0.10674
O  -1.96549 -1.191461 -0.779101
O  2.730403 -2.111759 0.531533
N  -3.41672 0.828233 -0.029882
C  4.673106 -0.267285 0.053091
C  -3.626763 1.494063 -1.311008
C  0.481818 0.613143 -0.104343
C  5.378561 1.030087 0.384691
C  5.043749 -0.790411 -1.320871
C  -3.317304 2.978618 -1.266306
C  0.987994 -0.574901 0.268298
C  2.395981 -0.966792 0.308112
C  1.224358 1.823839 -0.572066
C  -2.871825 -2.295381 -0.798378
H  4.913781 -1.013458 0.813583
H  -4.665447 1.336867 -1.607929
H  -3.017269 1.000592 -2.068146
H  -3.940968 1.199185 0.750415
H  5.097501 1.398558 1.372048
H  5.160533 1.807208 -0.350302
H  6.456813 0.868613 0.388251
H  6.115959 -0.986108 -1.36159
H  4.808029 -0.059226 -2.09637
H  4.533001 -1.723323 -1.559364
H  -2.274412 3.163268 -1.008868
H  -3.509923 3.43372 -2.238778
H  -3.943052 3.489816 -0.532645
H  0.329249 -1.375442 0.576079
H  1.941985 1.579546 -1.351548
H  1.773295 2.289103 0.24729
H  0.529364 2.561098 -0.969261
H  -3.896189 -1.962753 -0.976662
H  -2.561834 -2.944815 -1.61441
H  -2.832288 -2.8546 0.138293
elementType: S P O N C H
totalener: -1488.52939867 hartree
nucrepener: 1604.58409402 hartree
electener: -3093.11349269 hartree
oneelecener: -5234.65823869 hartree
twoeener: 2141.54474600 hartree
cpcmener: -0.02855049 hartree
kineticenergy: 1483.73530522 hartree
xcener: -107.351360568902 hartree
chargesum: 0.0000000
charge: -0.447079 0.613572 -0.290456 -0.288983 -0.337426 -0.493698 -0.247316 0.147069 -0.012705 0.288972 -0.258043 -0.260571 -0.250017 -0.271613 0.450478 -0.229089 -0.104709 0.069961 0.094571 0.093466 0.163186 0.097391 0.087957 0.094859 0.097816 0.088933 0.094775 0.076223 0.089545 0.086224 0.084496 0.102996 0.109555 0.106210 0.115881 0.128471 0.109100
qa: -0.4471 0.6136 -0.2905 -0.2890 -0.3374 -0.4937 -0.2473 0.1471 -0.0127 0.2890 -0.2580 -0.2606 -0.2500 -0.2716 0.4505 -0.2291 -0.1047 0.0700 0.0946 0.0935 0.1632 0.0974 0.0880 0.0949 0.0978 0.0889 0.0948 0.0762 0.0895 0.0862 0.0845 0.1030 0.1096 0.1062 0.1159 0.1285 0.1091
va: 2.0083 5.5138 2.1682 2.1156 2.0423 2.0047 3.1270 3.8152 3.8696 3.7261 3.9301 3.9131 3.9440 3.8492 4.2667 3.9442 3.8330 1.0235 0.9972 1.0106 1.0233 1.0083 1.0052 1.0065 1.0064 1.0051 1.0175 1.0083 1.0082 1.0024 1.0677 1.0091 1.0033 1.0104 0.9927 0.9903 1.0057
dispcorr: -0.017204723 hartree
energy: -1488.546603389625
dipole: 11.96358 -12.96910 -1.00552 10.77602 -8.69141 2.08461 -13.73775 11.56570 -2.17205
magnitude: 3.17403 au
magnitude: 8.06776 debye
