program: Orca
programVersion: 5.0.2
elementType: S P O O O O N C C C C C C C C C C H H H H H H H H H H H H H H H H H H H H
charge: 0
multiplicity: 1
keywords: wb97x-d3
keywords: def2-TZVPP
keywords: def2/J RIJCOSX
keywords: DEFGRID2
keywords: scfconv7
keywords: smallprint printgap noloewdin
keywords: NOSOSCF
formula: C10H20NO4PS
InChI: InChI=1/C10H20NO4PS/c1-6-11-16(17,13-5)15-9(4)7-10(12)14-8(2)3/h7-8,11H,6H2,1-5H3
37 atoms
S  -1.866029 -0.052876 2.359273
P  -2.141624 0.034163 0.459662
O  -1.014982 -0.752395 -0.447041
O  3.151401 -0.368687 -0.021981
O  -3.416275 -0.743463 -0.116516
O  2.813161 1.751932 0.606436
N  -2.242661 1.539135 -0.162133
C  4.587339 -0.241828 0.077651
C  -2.469115 1.88473 -1.561272
C  0.337223 -0.63163 -0.428154
C  5.148685 0.400781 -1.175649
C  5.117279 -1.644183 0.288903
C  -3.913547 2.235094 -1.86561
C  0.943926 0.432012 0.12487
C  2.380508 0.676781 0.24778
C  0.967796 -1.805835 -1.10268
C  -3.637782 -2.123819 0.185516
H  4.827978 0.37127 0.94932
H  -2.140388 1.055548 -2.188167
H  -1.818296 2.725996 -1.804985
H  -2.382161 2.280566 0.510117
H  6.235202 0.459888 -1.098214
H  4.776552 1.414142 -1.324786
H  4.909936 -0.189466 -2.062365
H  4.883609 -2.293997 -0.556536
H  4.710572 -2.095318 1.194886
H  6.201876 -1.612843 0.394167
H  -4.013446 2.549501 -2.905473
H  -4.574357 1.383102 -1.706144
H  -4.261106 3.057122 -1.237734
H  0.34944 1.239096 0.531385
H  1.802894 -1.516982 -1.734397
H  0.233822 -2.320338 -1.720516
H  1.339906 -2.520466 -0.36608
H  -2.985119 -2.764911 -0.408328
H  -3.478894 -2.328544 1.245487
H  -4.67369 -2.341041 -0.064255
elementType: S P O N C H
totalener: -1488.52974353 hartree
nucrepener: 1605.25815276 hartree
electener: -3093.78789629 hartree
oneelecener: -5235.89813489 hartree
twoeener: 2142.11023860 hartree
cpcmener: -0.02744286 hartree
kineticenergy: 1483.73239818 hartree
xcener: -107.351382791636 hartree
chargesum: -0.0000000
charge: -0.445037 0.629689 -0.307926 -0.289380 -0.336682 -0.493735 -0.242174 0.147895 -0.020087 0.277695 -0.262032 -0.257373 -0.247004 -0.270657 0.458453 -0.226237 -0.105112 0.069805 0.092429 0.095578 0.166860 0.098218 0.094913 0.088861 0.087869 0.097755 0.094145 0.088861 0.079243 0.083570 0.090888 0.100954 0.106188 0.111183 0.117941 0.100113 0.124329
qa: -0.4450 0.6297 -0.3079 -0.2894 -0.3367 -0.4937 -0.2422 0.1479 -0.0201 0.2777 -0.2620 -0.2574 -0.2470 -0.2707 0.4585 -0.2262 -0.1051 0.0698 0.0924 0.0956 0.1669 0.0982 0.0949 0.0889 0.0879 0.0978 0.0941 0.0889 0.0792 0.0836 0.0909 0.1010 0.1062 0.1112 0.1179 0.1001 0.1243
va: 2.0083 5.4972 2.1365 2.1155 2.0935 2.0039 3.0959 3.8149 3.8757 3.7196 3.9098 3.9308 3.9379 3.8459 4.2238 3.9351 3.8456 1.0232 1.0095 0.9956 1.0219 1.0061 1.0183 1.0052 1.0054 1.0081 1.0064 1.0084 1.0133 1.0023 1.0716 1.0118 1.0134 1.0026 0.9910 1.0066 0.9898
dispcorr: -0.017125523 hartree
energy: -1488.546869056386
dipole: 11.90354 -12.35318 -0.44964 -3.62723 2.47248 -1.15474 -14.63936 12.37953 -2.25983
magnitude: 2.57729 au
magnitude: 6.55096 debye
