program: Gaussian 09
title: 000066362
version: EM64L-G09RevD.01
frameworkgroup: C1[X(C14H12N2O4)]
method: RPBEPBE
basis: SDD
operation: Freq
keyword: #p
keyword: freq=noraman
keyword: PBEPBE/SDD
title: #p freq=noraman PBEPBE/SDD
converged: NO YES NO YES
title: Mulliken charges:
elementType: O O O O N N C C C C C C C C C C C C C C H H H H H H H H H H H H
charge: -0.193795 -0.193793 -0.194513 -0.194512 -0.365754 -0.348022 -0.187267 -0.187282 -0.280797 -0.280805 -0.257935 -0.257932 -0.244143 -0.244139 -0.246466 -0.246467 0.098492 0.098498 0.108213 0.108211 0.287739 0.287740 0.300809 0.300810 0.280342 0.280342 0.282393 0.282390 0.251396 0.251397 0.352749 0.352101
chargesum: 0.00000
title: Mulliken charges with hydrogens summed into heavy atoms:
elementType: O O O O N N C C C C C C C C C C C C C C
charge: -0.193795 -0.193793 -0.194513 -0.194512 -0.013005 0.004080 0.100472 0.100457 0.020013 0.020005 0.022406 0.022410 0.038250 0.038251 0.004930 0.004930 0.098492 0.098498 0.108213 0.108211
polarizability: 1.81419763e+02 2.45641385e-04 1.77783827e+02 -7.71567199e+00 1.12077039e-04 1.09222431e+02
1716.lowfreq: -22.3131 -6.8727 -4.8462 -0.0009 -0.0005 0.0005 35.9015 75.2042 85.9859
frequency: 35.7029 74.8506 85.9828 107.5754 141.1370 147.0319 161.4987 163.7948 217.0297 240.9765 286.4287 363.5921 385.9664 407.1656 431.8873 470.0977 510.1725 571.1920 585.6500 593.0034 597.6390 604.7721 627.1462 643.5631 660.9363 674.9951 679.8723 745.9642 759.9694 767.6714 770.2785 789.4423 800.2084 825.6162 842.8868 869.0067 903.6224 916.7561 934.8130 943.6335 944.4312 965.1666 984.3935 996.0320 1011.5016 1018.3517 1061.2219 1069.6012 1071.1830 1108.7697 1134.6263 1154.5153 1162.0636 1176.1044 1180.5855 1181.2448 1200.1423 1204.8555 1222.7994 1231.3144 1236.8247 1254.5216 1259.8687 1273.0337 1279.2485 1282.8428 1289.0336 1294.3559 1310.4258 1324.5470 1327.6367 1357.7326 1369.2632 1623.0351 1660.0599 1663.1356 1692.9349 1700.6273 3016.1108 3025.1666 3031.5152 3040.9216 3065.4577 3069.8563 3075.7480 3085.2064 3140.1726 3170.4676 3544.6916 3544.9345
redmass: 11.3696 5.5461 6.5509 9.1616 11.0219 7.9971 7.5887 6.1009 4.9887 4.2296 6.7733 6.6152 4.6325 7.0983 3.4376 5.1831 4.9505 4.9702 4.5486 4.8474 10.1904 10.6939 5.5572 5.4512 2.6556 3.0551 5.7410 1.4536 1.5380 4.2761 1.8246 4.2986 4.4369 2.8359 3.1087 2.7963 3.2096 3.0523 2.6407 2.0798 2.4614 1.4330 3.8598 2.9498 4.3625 2.2355 1.8017 2.9494 2.1617 1.3054 1.1884 2.9319 1.4293 2.9641 2.0105 1.3654 1.4013 1.3568 1.6290 1.7204 1.4796 1.4144 1.9166 3.4446 2.6297 1.6671 1.6212 1.9159 1.2895 1.7046 1.7374 1.5274 1.7574 5.9436 7.6151 7.6529 12.6855 12.7017 1.0840 1.0862 1.0853 1.0881 1.0872 1.0891 1.0861 1.0887 1.0869 1.1046 1.0790 1.0790
irintensity: 0.3471 0.2349 3.1399 0.9958 0.5789 18.4960 0.3270 2.4639 1.6980 0.3748 6.0848 24.5319 0.1900 7.4350 13.6654 0.5316 0.0060 4.1201 1.8635 6.6216 9.6324 4.0620 6.3788 21.1942 15.1568 9.3654 1.2412 184.8368 48.7607 3.6116 56.0413 3.3730 22.3935 4.2530 5.0245 0.8132 1.4960 3.3476 23.1098 0.1980 4.8333 3.2821 5.6082 2.2095 19.9025 7.3257 1.7920 0.0856 0.1054 0.4958 2.1013 102.5837 7.7692 146.1658 2.9350 18.8508 84.0950 13.0292 0.8332 30.6973 15.4542 2.0684 52.9428 218.4934 3.3822 6.5610 0.4014 35.6197 0.3266 12.2095 14.8349 8.0577 4.6981 0.7703 119.8830 1070.1732 173.3282 24.5096 4.7313 7.1817 9.2974 22.9975 23.0472 4.6385 4.5240 5.3816 1.7246 13.3223 73.4281 36.8142
temp: 298.150 k
press: 1.00000 atm
elementType: 8 8 8 8 7 7 6 6 6 6 6 6 6 6 6 6 6 6 6 6 1 1 1 1 1 1 1 1 1 1 1 1
symmnumber: 1
zpe: 636579.7 jmol-1
zpe.correction: 0.242460 hartree
zpe.thermalcorrener: 0.257246 hartree
zpe.thermalcorrenthalpy: 0.258191 hartree
zpe.thermalcorrgfe: 0.200162 hartree
zpe.sumelectzpe: -949.691499 hartree
zpe.sumelectthermal: -949.676713 hartree
zpe.sumelectthermalent: -949.675769 hartree
zpe.sumelectthermalfe: -949.733798 hartree
dipole: -0.3248 0.0000 0.3136
dipole: 0.4515
quadrupole: -129.0078 -144.9426 -104.8889
quadrupole: -0.0001 0.1965 -0.0002
quadrupole: -2.7280 -18.6628 21.3909 -0.0001 0.1965 -0.0002
hfenergy: -949.9339596 hartree
pointgroup: C01 [X(C14H12N2O4)]
dipole: -0.1272473 -0.0000172 0.1239508 debye
polarizability: 181.3493782|0.0007845|177.7838265|-8.0379233|0.0039004|109.292816 unknown
InChI: InChI=1S/C14H12N2O4/c17-11-7-3-1-2-4(8(7)12(18)15-11)6-5(3)9-10(6)14(20)16-13(9)19/h1-10,15-16H
charge 0 multiplicity 1
32 atoms
O  3.729124 -2.350965 -0.32435
O  3.729056 2.351153 -0.323919
O  -3.57179 -2.346837 -0.161541
O  -3.571872 2.346712 -0.161402
N  3.984613 0.000107 -0.436003
N  -3.860424 -0.000069 -0.122115
C  0.735653 -0.790247 -0.37829
C  0.73563 0.790297 -0.378214
C  1.99462 -0.781107 0.573804
C  1.994573 0.781087 0.573907
C  -0.601107 -1.317469 0.226563
C  -0.601156 1.317407 0.226676
C  -1.708231 -0.780026 -0.754085
C  -1.708254 0.780003 -0.754027
C  -0.835693 -0.681665 1.589444
C  -0.835727 0.681479 1.589499
C  3.306334 -1.195731 -0.089953
C  3.306266 1.195865 -0.089796
C  -3.124385 -1.188577 -0.319455
C  -3.124427 1.188477 -0.319386
H  0.918068 -1.264973 -1.358553
H  0.918035 1.265133 -1.358427
H  1.852007 -1.299263 1.534049
H  1.851941 1.299115 1.534221
H  -0.62724 -2.418756 0.261495
H  -0.627326 2.41869 0.261701
H  -1.524098 -1.198551 -1.760837
H  -1.524118 1.198607 -1.760746
H  -1.010178 -1.293172 2.480127
H  -1.01024 1.292905 2.480232
H  4.893211 0.000163 -0.907296
H  -4.838468 -0.000095 0.179677
