program: Orca
programVersion: 5.0.2
elementType: S P O O O O N C C C C C C C C C C H H H H H H H H H H H H H H H H H H H H
charge: 0
multiplicity: 1
keywords: wb97x-d3
keywords: def2-TZVPP
keywords: def2/J RIJCOSX
keywords: DEFGRID2
keywords: scfconv7
keywords: smallprint printgap noloewdin
keywords: NOSOSCF
formula: C10H20NO4PS
InChI: InChI=1/C10H20NO4PS/c1-6-11-16(17,13-5)15-9(4)7-10(12)14-8(2)3/h7-8,11H,6H2,1-5H3
37 atoms
S  -1.220319 2.56556 0.307641
P  -1.877838 0.804697 -0.102439
O  -1.083044 -0.040305 -1.254912
O  3.040133 -0.320173 0.843445
O  -1.76862 -0.280512 1.073451
O  3.054249 -1.338751 -1.147554
N  -3.420062 0.797781 -0.657266
C  4.425361 -0.640727 1.092194
C  -4.099656 -0.310444 -1.332117
C  0.192556 -0.508595 -1.292758
C  4.596093 -0.617654 2.59575
C  5.326723 0.356636 0.391854
C  -4.170031 -1.587415 -0.518687
C  1.07989 -0.244088 -0.320757
C  2.470379 -0.703341 -0.296784
C  0.385122 -1.299261 -2.535937
C  -2.313659 0.026446 2.357709
H  4.629647 -1.648236 0.722522
H  -3.645025 -0.51327 -2.305734
H  -5.112123 0.041262 -1.527897
H  -3.752337 1.714855 -0.920621
H  5.622075 -0.883242 2.851655
H  3.937877 -1.337355 3.084185
H  4.394403 0.372171 3.009411
H  5.133119 1.373706 0.737716
H  5.207419 0.331888 -0.69125
H  6.369733 0.123543 0.609996
H  -4.811711 -2.301861 -1.036096
H  -3.19779 -2.062623 -0.393833
H  -4.599306 -1.409188 0.467904
H  0.789835 0.361033 0.527257
H  -0.359923 -2.096514 -2.58542
H  1.371733 -1.739495 -2.603457
H  0.228842 -0.66043 -3.40815
H  -3.385297 0.223526 2.298923
H  -2.146711 -0.844044 2.987293
H  -1.813995 0.889174 2.80025
elementType: S P O N C H
totalener: -1488.53011602 hartree
nucrepener: 1608.19740878 hartree
electener: -3096.72752480 hartree
oneelecener: -5242.10271767 hartree
twoeener: 2145.37519286 hartree
cpcmener: -0.02486494 hartree
kineticenergy: 1483.74586361 hartree
xcener: -107.354112734194 hartree
chargesum: -0.0000000
charge: -0.449620 0.606483 -0.298670 -0.293106 -0.330960 -0.489168 -0.254164 0.157788 -0.029474 0.293619 -0.253128 -0.262771 -0.256418 -0.261350 0.474831 -0.258092 -0.109729 0.062710 0.089702 0.097188 0.170565 0.088935 0.096299 0.088741 0.089575 0.094295 0.094812 0.099917 0.084465 0.082844 0.088183 0.108121 0.109298 0.110223 0.113741 0.130291 0.114025
qa: -0.4496 0.6065 -0.2987 -0.2931 -0.3310 -0.4892 -0.2542 0.1578 -0.0295 0.2936 -0.2531 -0.2628 -0.2564 -0.2614 0.4748 -0.2581 -0.1097 0.0627 0.0897 0.0972 0.1706 0.0889 0.0963 0.0887 0.0896 0.0943 0.0948 0.0999 0.0845 0.0828 0.0882 0.1081 0.1093 0.1102 0.1137 0.1303 0.1140
va: 2.0143 5.5115 2.1711 2.1296 2.0363 2.0134 3.1150 3.8198 3.8994 3.7128 3.9330 3.9062 3.9133 3.7853 4.2260 3.9423 3.8269 1.0227 0.9974 0.9939 1.0187 1.0056 1.0083 1.0068 1.0068 1.0170 1.0060 1.0085 1.0097 1.0057 1.0702 1.0005 1.0353 1.0003 0.9971 0.9896 1.0072
dispcorr: -0.016769425 hartree
energy: -1488.546885448389
dipole: 5.89569 -7.80630 -1.91061 -10.90575 9.96725 -0.93850 4.66111 -4.25094 0.41017
magnitude: 2.16782 au
magnitude: 5.51015 debye
