program: Gaussian 09
title: 000066357
version: EM64L-G09RevD.01
frameworkgroup: C1[X(C12H14O3)]
method: RPBEPBE
basis: SDD
operation: Freq
keyword: #pfreq=noraman
keyword: PBEPBE/SDD
title: #p freq=noraman PBEPBE/SDD
converged: NO YES NO NO
title: Mulliken charges:
elementType: O O O C C C C C C C C C C C C H H H H H H H H H H H H H H
charge: -0.266570 -0.268717 -0.251745 -0.286837 -0.282380 0.365681 -0.347158 -0.375344 -0.224914 -0.196285 -0.256195 0.171995 0.341232 -0.753769 -0.629851 0.223192 0.205424 0.251067 0.222366 0.244771 0.250937 0.223467 0.227927 0.228366 0.248217 0.236937 0.214162 0.229268 0.254757
chargesum: 0.00000
title: Mulliken charges with hydrogens summed into heavy atoms:
elementType: O O O C C C C C C C C C C C C
charge: -0.266570 -0.268717 -0.251745 0.141779 0.191053 0.365681 -0.102387 -0.124407 -0.001447 0.031642 -0.027830 0.171995 0.341232 -0.054453 -0.145826
polarizability: 1.98136081e+02 -8.92204512e+00 1.15764060e+02 -1.55253732e+01 -1.12690650e+01 1.04493207e+02
1716.lowfreq: -7.3619 -2.6952 -0.0009 -0.0008 -0.0007 9.1601 16.6921 25.3594 37.6367
frequency: 16.5107 25.3286 37.6100 65.6404 87.1108 129.4856 155.9456 164.8526 182.2160 232.8422 255.9440 290.5144 364.3805 394.0538 405.3268 411.5712 422.0777 485.6591 502.6564 568.5985 597.4642 609.7617 632.7161 692.2382 757.5263 760.2054 783.9696 795.1483 823.5141 867.5228 890.0357 903.8168 949.8533 961.0616 982.3558 982.7512 989.6254 1009.6200 1016.7928 1022.4576 1041.8036 1054.3165 1083.4786 1109.0684 1116.0077 1167.5114 1177.7579 1205.6720 1219.5032 1254.6412 1288.4861 1312.9317 1358.6122 1379.0139 1396.1236 1398.0397 1415.8631 1443.3175 1452.4959 1457.2497 1458.7237 1472.6545 1480.8753 1591.3630 1609.9612 1612.4078 1653.9686 2960.0384 2990.2428 3014.1023 3027.0970 3074.5251 3086.4817 3098.0877 3104.0194 3128.3298 3137.4550 3155.5455 3164.1425 3173.2307 3215.9221
redmass: 4.7167 4.7010 3.9939 4.4126 4.8934 5.4372 3.8830 3.4992 1.0646 5.1127 2.4425 3.2078 2.7403 3.5405 3.7750 3.0429 4.3269 4.0049 2.8700 4.5872 3.9719 6.4379 1.5459 2.0641 1.9122 2.9381 2.1044 3.9674 1.2966 3.6650 1.4717 3.2940 1.9578 1.3647 5.8329 1.3016 1.3179 1.4667 2.3878 2.1334 2.3773 1.5017 1.5302 2.2486 5.1777 1.0827 1.1745 1.0985 3.3658 1.1065 3.3279 1.3350 1.3696 2.7564 2.2603 1.2011 1.2517 2.3068 1.0789 1.0478 1.1627 1.0624 2.0462 6.4420 10.8062 6.4202 5.1870 1.0569 1.0362 1.0686 1.0951 1.0971 1.1054 1.1007 1.0620 1.0848 1.0889 1.0924 1.0953 1.1005 1.1156
irintensity: 0.7073 0.3367 0.5068 1.4829 4.1989 0.6748 4.2216 3.2524 1.6616 0.5045 6.3519 4.1008 1.5783 0.3085 2.1788 0.4568 11.4737 2.3567 12.0997 3.9503 8.4351 0.4549 10.1088 32.6799 73.1076 27.3014 8.1069 9.3969 0.8080 5.1015 9.8067 68.2365 14.5199 0.1722 0.2694 0.6982 58.8953 9.3385 11.2435 25.8751 19.6331 6.4770 16.4819 12.4221 536.9641 7.8327 36.7159 2.5089 207.9679 6.6513 110.1415 0.2609 1.4991 2.3223 30.6592 12.5206 11.0741 2.9256 9.9572 20.0739 79.3218 33.8566 62.1426 25.5252 182.2837 48.9233 3.7127 36.6334 15.1322 9.4020 44.7894 14.4412 17.4058 27.0011 4.3267 3.0280 11.7531 34.2349 21.3435 4.9871 5.4476
temp: 298.150 k
press: 1.00000 atm
elementType: 8 8 8 6 6 6 6 6 6 6 6 6 6 6 6 1 1 1 1 1 1 1 1 1 1 1 1 1 1
symmnumber: 1
zpe: 608706.8 jmol-1
zpe.correction: 0.231844 hartree
zpe.thermalcorrener: 0.246820 hartree
zpe.thermalcorrenthalpy: 0.247764 hartree
zpe.thermalcorrgfe: 0.186885 hartree
zpe.sumelectzpe: -690.203485 hartree
zpe.sumelectthermal: -690.188510 hartree
zpe.sumelectthermalent: -690.187566 hartree
zpe.sumelectthermalfe: -690.248444 hartree
dipole: -1.1070 0.4082 2.0325
dipole: 2.3501
quadrupole: -86.4509 -83.9985 -87.1240
quadrupole: 7.9484 2.0429 -5.7732
quadrupole: -0.5931 1.8593 -1.2662 7.9484 2.0429 -5.7732
hfenergy: -690.4353294 hartree
pointgroup: C01 [X(C12H14O3)]
dipole: -0.4522808 -0.1141507 -0.7983244 debye
polarizability: 199.0051755|5.98196|116.3741292|13.9948233|-11.2283047|103.0140444 unknown
InChI: InChI=1S/C12H14O3/c1-10(2)12(13)15-9-8-14-11-6-4-3-5-7-11/h3-7H,1,8-9H2,2H3
charge 0 multiplicity 1
29 atoms
O  -0.927077 0.473959 0.574053
O  1.91018 0.340926 -0.259897
O  3.804285 1.200049 0.789163
C  -0.254545 1.420789 -0.323727
C  1.178503 1.564668 0.153946
C  -2.267971 0.151586 0.298313
C  -3.019475 0.695679 -0.773412
C  -2.859015 -0.780835 1.187229
C  -4.366465 0.296511 -0.944541
C  -4.200954 -1.166394 1.003056
C  -4.964683 -0.630729 -0.064166
C  3.251174 0.273691 0.145815
C  3.881144 -1.016184 -0.29106
C  3.040606 -2.020532 -1.051451
C  5.189561 -1.208208 0.03423
H  -0.277781 1.05026 -1.368125
H  -0.76007 2.40828 -0.278104
H  1.228818 1.668268 1.251761
H  1.664756 2.444385 -0.306957
H  -2.579608 1.416395 -1.469255
H  -2.253265 -1.18419 2.004612
H  -4.946434 0.717601 -1.773696
H  -4.652623 -1.887422 1.693547
H  -6.00762 -0.933316 -0.204304
H  2.152116 -2.316585 -0.465707
H  2.661656 -1.588054 -1.995006
H  3.629521 -2.923106 -1.287342
H  5.717495 -2.126089 -0.245996
H  5.74377 -0.443505 0.589424
