program: Orca
programVersion: 5.0.2
elementType: S P O O O O N C C C C C C C C C C H H H H H H H H H H H H H H H H H H H H
charge: 0
multiplicity: 1
keywords: wb97x-d3
keywords: def2-TZVPP
keywords: def2/J RIJCOSX
keywords: DEFGRID2
keywords: scfconv7
keywords: smallprint printgap noloewdin
keywords: NOSOSCF
formula: C10H20NO4PS
InChI: InChI=1/C10H20NO4PS/c1-6-11-16(17,13-5)15-9(4)7-10(12)14-8(2)3/h7-8,11H,6H2,1-5H3
37 atoms
S  -1.995827 0.704184 1.857067
P  -2.097749 -0.01103 0.077021
O  -0.917235 -1.079085 -0.323433
O  3.215499 -0.406581 0.166753
O  -3.348894 -0.967672 -0.222935
O  2.811371 1.763497 -0.191872
N  -2.073677 1.084236 -1.143391
C  4.641418 -0.18821 0.259215
C  -2.666614 2.414102 -1.032508
C  0.432571 -0.925382 -0.236621
C  5.252755 -0.138174 -1.127296
C  5.186461 -1.327112 1.093232
C  -4.182865 2.418147 -1.080415
C  0.996212 0.292928 -0.192959
C  2.416765 0.621271 -0.080353
C  1.102297 -2.259899 -0.217515
C  -3.658242 -2.074047 0.629683
H  4.821074 0.756459 0.777576
H  -2.2570 3.008617 -1.849165
H  -2.311382 2.86845 -0.107782
H  -2.080767 0.69679 -2.079886
H  4.84876 0.677783 -1.726466
H  5.09085 -1.074688 -1.664298
H  6.329169 0.018901 -1.046718
H  4.728244 -1.353368 2.082641
H  6.260079 -1.197735 1.23104
H  5.025065 -2.293155 0.611301
H  -4.552213 1.939574 -1.988652
H  -4.609029 1.894164 -0.223586
H  -4.560689 3.441153 -1.063896
H  0.373202 1.173725 -0.265987
H  1.968702 -2.292772 -0.872738
H  0.405311 -3.033967 -0.533552
H  1.439346 -2.509307 0.790259
H  -4.660653 -2.40538 0.368097
H  -2.959481 -2.896962 0.474372
H  -3.644817 -1.782202 1.680868
elementType: S P O N C H
totalener: -1488.52806094 hartree
nucrepener: 1605.03832347 hartree
electener: -3093.56638441 hartree
oneelecener: -5235.61904043 hartree
twoeener: 2142.05265601 hartree
cpcmener: -0.02754761 hartree
kineticenergy: 1483.74337717 hartree
xcener: -107.352159093604 hartree
chargesum: -0.0000000
charge: -0.453020 0.697748 -0.313839 -0.289629 -0.351497 -0.493775 -0.268113 0.148120 -0.013543 0.268132 -0.262217 -0.257655 -0.240568 -0.273853 0.453922 -0.225161 -0.109583 0.070082 0.096161 0.087506 0.158136 0.095258 0.088794 0.098571 0.097652 0.094350 0.088091 0.082962 0.074773 0.089790 0.097972 0.101664 0.105886 0.111130 0.126183 0.119504 0.100069
qa: -0.4530 0.6977 -0.3138 -0.2896 -0.3515 -0.4938 -0.2681 0.1481 -0.0135 0.2681 -0.2622 -0.2577 -0.2406 -0.2739 0.4539 -0.2252 -0.1096 0.0701 0.0962 0.0875 0.1581 0.0953 0.0888 0.0986 0.0977 0.0944 0.0881 0.0830 0.0748 0.0898 0.0980 0.1017 0.1059 0.1111 0.1262 0.1195 0.1001
va: 1.9827 5.4426 2.1777 2.1176 2.0952 2.0040 3.0948 3.8120 3.8719 3.7499 3.9123 3.9316 3.9166 3.8468 4.2405 3.9312 3.8477 1.0241 0.9974 1.0188 1.0260 1.0176 1.0052 1.0061 1.0083 1.0064 1.0054 1.0059 1.0155 1.0101 1.0602 1.0106 1.0143 1.0024 0.9888 0.9903 1.0064
dispcorr: -0.016974256 hartree
energy: -1488.545035194416
dipole: 11.36985 -11.73906 -0.36921 -4.61661 2.65449 -1.96212 -5.68490 4.23366 -1.45124
magnitude: 2.46826 au
magnitude: 6.27381 debye
