program: Orca
programVersion: 5.0.2
elementType: S P O O O O N C C C C C C C C C C H H H H H H H H H H H H H H H H H H H H
charge: 0
multiplicity: 1
keywords: wb97x-d3
keywords: def2-TZVPP
keywords: def2/J RIJCOSX
keywords: DEFGRID2
keywords: scfconv7
keywords: smallprint printgap noloewdin
keywords: NOSOSCF
formula: C10H20NO4PS
InChI: InChI=1/C10H20NO4PS/c1-6-11-16(17,13-5)15-9(4)7-10(12)14-8(2)3/h7-8,11H,6H2,1-5H3
37 atoms
S  -1.981157 0.729264 1.853107
P  -2.095787 -0.005289 0.081731
O  -0.919565 -1.079215 -0.314688
O  3.213128 -0.40259 0.172815
O  -3.351332 -0.961863 -0.200196
O  2.815124 1.757494 -0.248921
N  -2.076999 1.076679 -1.150738
C  4.639166 -0.18617 0.266129
C  -2.674515 2.405441 -1.053414
C  0.431094 -0.927126 -0.233325
C  5.25733 -0.174514 -1.118079
C  5.17617 -1.30455 1.132703
C  -4.190781 2.403033 -1.101521
C  0.996806 0.29078 -0.213553
C  2.417859 0.619565 -0.106687
C  1.097082 -2.262712 -0.190469
C  -3.653284 -2.0631 0.661874
H  4.819283 0.77133 0.760259
H  -2.267126 2.993062 -1.876147
H  -2.32079 2.870336 -0.133368
H  -2.086951 0.678267 -2.082589
H  4.858627 0.626201 -1.740813
H  5.095528 -1.124514 -1.630973
H  6.333768 -0.018262 -1.036319
H  4.712409 -1.303494 2.119866
H  6.249438 -1.175238 1.273086
H  5.014112 -2.282348 0.675272
H  -4.557824 1.912337 -2.004226
H  -4.615207 1.887363 -0.238858
H  -4.572756 3.424572 -1.097256
H  0.374842 1.170622 -0.304834
H  0.403647 -3.0378 -0.512114
H  1.413841 -2.503835 0.826054
H  1.975448 -2.304267 -0.828767
H  -3.627421 -1.765785 1.711289
H  -4.659268 -2.393839 0.413405
H  -2.957998 -2.888289 0.502914
elementType: S P O N C H
totalener: -1488.52809445 hartree
nucrepener: 1605.10749201 hartree
electener: -3093.63558646 hartree
oneelecener: -5235.75720347 hartree
twoeener: 2142.12161701 hartree
cpcmener: -0.02756513 hartree
kineticenergy: 1483.74286134 hartree
xcener: -107.351988050701 hartree
chargesum: 0.0000000
charge: -0.453158 0.697528 -0.314539 -0.289476 -0.351302 -0.493590 -0.267804 0.148146 -0.013739 0.267689 -0.261932 -0.257549 -0.240573 -0.274307 0.454125 -0.225948 -0.109529 0.070146 0.096127 0.087556 0.158043 0.095085 0.088805 0.098652 0.097637 0.094195 0.088160 0.082952 0.074808 0.089812 0.099147 0.106027 0.111586 0.101480 0.100116 0.126168 0.119454
qa: -0.4532 0.6975 -0.3145 -0.2895 -0.3513 -0.4936 -0.2678 0.1481 -0.0137 0.2677 -0.2619 -0.2575 -0.2406 -0.2743 0.4541 -0.2259 -0.1095 0.0701 0.0961 0.0876 0.1580 0.0951 0.0888 0.0987 0.0976 0.0942 0.0882 0.0830 0.0748 0.0898 0.0991 0.1060 0.1116 0.1015 0.1001 0.1262 0.1195
va: 1.9828 5.4430 2.1765 2.1175 2.0950 2.0041 3.0952 3.8121 3.8721 3.7494 3.9123 3.9318 3.9168 3.8469 4.2389 3.9315 3.8477 1.0240 0.9974 1.0189 1.0261 1.0177 1.0051 1.0061 1.0083 1.0064 1.0053 1.0059 1.0154 1.0101 1.0599 1.0140 1.0021 1.0110 1.0063 0.9888 0.9903
dispcorr: -0.016979191 hartree
energy: -1488.545073640590
dipole: 11.29885 -11.67799 -0.37914 -4.74384 2.76190 -1.98193 -5.50949 4.10705 -1.40244
magnitude: 2.45736 au
magnitude: 6.24612 debye
