program: Gaussian 09
title: 000066356
version: EM64L-G09RevD.01
frameworkgroup: C1[X(C9H18O2)]
method: RPBEPBE
basis: SDD
operation: Freq
keyword: #pfreq=noraman
keyword: PBEPBE/SDD
title: #p freq=noraman PBEPBE/SDD
converged: YES YES NO NO
title: Mulliken charges:
elementType: O O C C C C C C C C C H H H H H H H H H H H H H H H H H H
charge: -0.274636 -0.241191 -0.078885 -0.252556 -0.344497 -0.512228 -0.341331 -0.690748 -0.698370 0.248827 -0.692260 0.214237 0.225509 0.216472 0.204503 0.216613 0.236330 0.241485 0.192600 0.191567 0.212180 0.199876 0.240032 0.221945 0.215620 0.208610 0.211523 0.212953 0.215822
chargesum: 0.00000
title: Mulliken charges with hydrogens summed into heavy atoms:
elementType: O O C C C C C C C C C
charge: -0.274636 -0.241191 0.135352 0.189425 0.076618 -0.034413 0.042836 -0.038660 -0.052196 0.248827 -0.051962
polarizability: 1.36258611e+02 -8.97164840e-02 9.67190489e+01 -1.74313538e+00 -1.49688369e+00 8.35719767e+01
1716.lowfreq: -22.5778 -15.0128 -0.0006 -0.0005 0.0006 6.2107 13.3101 31.9850 48.9861
frequency: -21.3375 31.0700 48.9109 61.7132 85.4558 107.6260 145.5794 179.7358 195.1026 225.9288 232.3174 234.1591 264.0719 299.3341 357.8827 410.0012 419.5386 507.9618 554.2289 669.8968 725.7563 789.9519 821.3696 863.4488 894.9409 906.4892 919.8997 920.8955 929.7461 964.6335 970.7245 1036.5345 1082.8167 1098.0245 1107.9791 1137.7702 1138.9653 1151.0410 1188.6655 1205.8880 1230.8540 1260.3772 1275.3883 1289.2754 1295.0550 1331.5059 1340.8038 1359.4998 1367.2419 1377.1766 1390.9145 1396.6632 1440.4323 1462.8284 1467.7848 1468.7687 1475.1883 1475.7725 1476.5884 1480.9098 1487.7690 1490.2441 1639.4110 2963.2803 2972.2492 2974.3244 2975.6492 2980.1176 2988.4920 2994.0711 2996.3054 3006.7944 3033.6602 3059.0806 3059.7509 3063.7086 3072.4486 3072.9912 3073.8500 3078.3378 3091.4491
redmass: 2.0523 4.8401 2.3498 3.7437 2.6641 1.9499 3.3714 1.8889 1.2630 1.1402 3.1284 1.2438 2.6550 4.5851 2.5249 2.6907 2.0713 3.4102 2.8316 5.9632 1.1100 1.2772 2.9023 3.8493 1.5189 1.8883 1.3155 1.2806 2.1165 1.7157 2.0736 3.4489 2.0595 2.5343 1.7002 2.0456 2.9720 1.7490 1.7536 1.4459 1.2609 1.3791 1.1916 1.0638 1.3355 1.4897 1.4610 1.5744 1.6604 1.2130 1.2201 1.2270 1.0859 1.0663 1.0689 1.0451 1.0669 1.0610 1.0461 1.0492 1.0830 1.0576 9.8389 1.0590 1.0358 1.0365 1.0376 1.0634 1.0769 1.0610 1.0629 1.0992 1.0968 1.1052 1.1023 1.0994 1.1008 1.1007 1.0996 1.0989 1.0993
irintensity: 0.0152 0.7997 0.3308 0.4537 0.5447 0.1133 1.6488 4.7814 1.5806 0.2596 1.1228 1.7565 3.0890 10.0204 1.3005 0.8842 3.0760 1.3961 2.2502 3.0961 12.8131 0.2168 1.2739 11.3012 3.3878 12.1437 1.8771 5.7626 21.8597 15.4310 53.2321 29.4406 5.0327 126.7782 2.1086 0.1206 267.9423 0.5713 5.2890 1.7648 1.4426 56.8181 5.1153 0.3767 0.1182 29.8128 5.9611 0.3010 13.2134 23.7992 17.1175 11.5524 21.9330 2.7252 0.7942 2.2129 6.2837 5.3679 11.6453 13.6013 18.8374 24.1982 171.7744 32.9062 31.7002 36.2515 23.1921 3.6196 6.2768 34.5007 35.6112 11.0525 0.9396 3.7268 9.0890 19.6590 41.9772 125.8240 66.4411 58.7083 34.1154
temp: 298.150 k
press: 1.00000 atm
elementType: 8 8 6 6 6 6 6 6 6 6 6 1 1 1 1 1 1 1 1 1 1 1 1 1 1 1 1 1 1
symmnumber: 1
zpe: 667654.2 jmol-1
zpe.correction: 0.254296 hartree
zpe.thermalcorrener: 0.267896 hartree
zpe.thermalcorrenthalpy: 0.268840 hartree
zpe.thermalcorrgfe: 0.213019 hartree
zpe.sumelectzpe: -503.300411 hartree
zpe.sumelectthermal: -503.286812 hartree
zpe.sumelectthermalent: -503.285868 hartree
zpe.sumelectthermalfe: -503.341688 hartree
dipole: 0.7985 1.6559 -0.6405
dipole: 1.9468
quadrupole: -61.4151 -74.3524 -68.4305
quadrupole: -3.1402 0.2286 2.2317
quadrupole: 6.6509 -6.2864 -0.3645 -3.1402 0.2286 2.2317
hfenergy: -503.5547072 hartree
pointgroup: C01 [X(C9H18O2)]
dipole: 0.3163224 0.6398718 -0.2777439 debye
polarizability: 136.2588687|-0.284294|96.5793651|-1.7192307|-2.01346|83.7114026 unknown
InChI: InChI=1S/C9H18O2/c1-4-5-6-9(10)11-7-8(2)3/h8H,4-7H2,1-3H3
charge 0 multiplicity 1
29 atoms
O  0.898439 0.193585 -0.192243
O  -0.349287 -1.589061 0.64066
C  3.336286 0.295814 -0.35521
C  2.147996 -0.591694 0.0395
C  -2.844461 -0.208914 0.020685
C  -1.479012 0.497947 -0.085383
C  -4.024991 0.775336 -0.136839
C  3.423642 1.555429 0.536002
C  4.637747 -0.539069 -0.28321
C  -0.301177 -0.430186 0.167165
C  -5.397068 0.075363 -0.03483
H  3.179092 0.616778 -1.404655
H  2.096478 -1.512599 -0.570773
H  2.188596 -0.884038 1.106439
H  -2.912809 -0.999854 -0.751522
H  -2.913216 -0.727444 0.995732
H  -1.416557 1.324223 0.652454
H  -1.344762 0.972703 -1.075685
H  -3.946013 1.295432 -1.11362
H  -3.951941 1.562421 0.641787
H  4.255109 2.207916 0.212246
H  3.604767 1.275148 1.592038
H  2.486962 2.137036 0.489332
H  5.507647 0.07486 -0.578133
H  4.599188 -1.417934 -0.95373
H  4.818282 -0.902798 0.74668
H  -5.506148 -0.698676 -0.817686
H  -5.515053 -0.422781 0.945794
H  -6.228435 0.794458 -0.151795
