program: Orca
programVersion: 5.0.2
elementType: S P O O O O N C C C C C C C C C C H H H H H H H H H H H H H H H H H H H H
charge: 0
multiplicity: 1
keywords: wb97x-d3
keywords: def2-TZVPP
keywords: def2/J RIJCOSX
keywords: DEFGRID2
keywords: scfconv7
keywords: smallprint printgap noloewdin
keywords: NOSOSCF
formula: C10H20NO4PS
InChI: InChI=1/C10H20NO4PS/c1-6-11-16(17,13-5)15-9(4)7-10(12)14-8(2)3/h7-8,11H,6H2,1-5H3
37 atoms
S  -2.470441 -0.045488 1.93922
P  -2.322592 -0.176445 0.025641
O  -0.80127 -0.054054 -0.566069
O  3.695189 0.50039 -0.391316
O  -2.733713 -1.570581 -0.65307
O  3.157058 -1.523399 0.393712
N  -3.16179 0.957304 -0.814952
C  5.107328 0.254784 -0.232333
C  -3.38581 2.312158 -0.323699
C  0.335612 -0.690524 -0.15774
C  5.529476 0.543781 1.195409
C  5.807313 1.149396 -1.233332
C  -2.157471 3.202859 -0.371819
C  1.460699 0.024803 -0.312829
C  2.823167 -0.447094 -0.051302
C  0.190501 -2.087068 0.326161
C  -4.045946 -2.09568 -0.447312
H  5.317233 -0.789515 -0.475468
H  -3.764787 2.245035 0.695962
H  -4.188439 2.738754 -0.925735
H  -3.094174 0.880885 -1.824058
H  5.331151 1.583545 1.462143
H  6.60073 0.369922 1.303237
H  5.020301 -0.099288 1.91337
H  5.6217 2.205467 -1.029312
H  5.489706 0.933403 -2.254283
H  6.883548 0.983783 -1.181139
H  -1.372596 2.83465 0.290858
H  -1.748687 3.263987 -1.381607
H  -2.410383 4.214786 -0.052371
H  1.372995 1.035342 -0.693504
H  1.144585 -2.507708 0.616911
H  -0.240058 -2.713531 -0.456639
H  -0.476128 -2.131776 1.189485
H  -4.104114 -3.025269 -1.008548
H  -4.228139 -2.304211 0.60794
H  -4.810117 -1.40958 -0.815481
elementType: S P O N C H
totalener: -1488.53015663 hartree
nucrepener: 1578.31529516 hartree
electener: -3066.84545180 hartree
oneelecener: -5182.27544489 hartree
twoeener: 2115.42999309 hartree
cpcmener: -0.02442939 hartree
kineticenergy: 1483.74149678 hartree
xcener: -107.352261153701 hartree
chargesum: -0.0000000
charge: -0.456871 0.696658 -0.313582 -0.295787 -0.347261 -0.488989 -0.279565 0.161497 -0.022497 0.216715 -0.264177 -0.250713 -0.236322 -0.281783 0.500237 -0.236730 -0.112950 0.061587 0.087751 0.093384 0.162292 0.089149 0.094849 0.094749 0.087910 0.095799 0.088961 0.072870 0.083091 0.090989 0.124845 0.114792 0.116174 0.103921 0.127659 0.104990 0.116357
qa: -0.4569 0.6967 -0.3136 -0.2958 -0.3473 -0.4890 -0.2796 0.1615 -0.0225 0.2167 -0.2642 -0.2507 -0.2363 -0.2818 0.5002 -0.2367 -0.1129 0.0616 0.0878 0.0934 0.1623 0.0891 0.0948 0.0947 0.0879 0.0958 0.0890 0.0729 0.0831 0.0910 0.1248 0.1148 0.1162 0.1039 0.1277 0.1050 0.1164
va: 1.9726 5.4385 2.1421 2.1285 2.0866 2.0106 3.1403 3.8179 3.8921 3.7718 3.9089 3.9297 3.8944 3.8599 4.1294 3.8804 3.8552 1.0240 1.0198 0.9980 1.0221 1.0067 1.0061 1.0164 1.0071 1.0086 1.0056 1.0146 1.0063 1.0110 1.0311 1.0400 1.0051 1.0261 0.9904 0.9999 0.9968
dispcorr: -0.016156314 hartree
energy: -1488.546312947771
dipole: 13.11073 -14.16741 -1.05668 8.01342 -7.25289 0.76053 -4.42577 2.46553 -1.96024
magnitude: 2.35320 au
magnitude: 5.98135 debye
