program: Orca
programVersion: 5.0.2
elementType: S P O O O O N C C C C C C C C C C H H H H H H H H H H H H H H H H H H H H
charge: 0
multiplicity: 1
keywords: wb97x-d3
keywords: def2-TZVPP
keywords: def2/J RIJCOSX
keywords: DEFGRID2
keywords: scfconv7
keywords: smallprint printgap noloewdin
keywords: NOSOSCF
formula: C10H20NO4PS
InChI: InChI=1/C10H20NO4PS/c1-6-11-16(17,13-5)15-9(4)7-10(12)14-8(2)3/h7-8,11H,6H2,1-5H3
37 atoms
S  -2.4608 -0.041835 1.937892
P  -2.322067 -0.176923 0.023458
O  -0.800995 -0.065902 -0.571632
O  3.692821 0.501051 -0.387928
O  -2.742634 -1.568696 -0.650804
O  3.160397 -1.530122 0.382648
N  -3.160246 0.958925 -0.813434
C  5.108313 0.261234 -0.229804
C  -3.37679 2.31872 -0.327143
C  0.336157 -0.704104 -0.165228
C  5.528522 0.537899 1.200374
C  5.80304 1.169685 -1.221536
C  -2.147486 3.206205 -0.386251
C  1.46006 0.014514 -0.316218
C  2.824598 -0.450982 -0.054984
C  0.189772 -2.102381 0.312632
C  -4.054053 -2.093777 -0.428978
H  5.322675 -0.779539 -0.483508
H  -3.751906 2.258144 0.694271
H  -4.180392 2.743367 -0.929195
H  -3.110101 0.879641 -1.823244
H  5.32782 1.574343 1.477856
H  6.600547 0.366317 1.305538
H  5.022529 -0.114122 1.912328
H  5.487971 0.961314 -2.244708
H  6.880337 1.010256 -1.169795
H  5.611419 2.222719 -1.007757
H  -2.398988 4.219845 -0.070465
H  -1.359184 2.84169 0.274251
H  -1.744154 3.263415 -1.398405
H  1.364293 1.025838 -0.692517
H  -0.24826 -2.724239 -0.469854
H  -0.471676 -2.149049 1.180002
H  1.144425 -2.528179 0.594945
H  -4.117867 -3.023971 -0.988256
H  -4.22279 -2.300034 0.628758
H  -4.821407 -1.407475 -0.789423
elementType: S P O N C H
totalener: -1488.53025107 hartree
nucrepener: 1577.82366316 hartree
electener: -3066.35391423 hartree
oneelecener: -5181.32137195 hartree
twoeener: 2114.96745772 hartree
cpcmener: -0.02462599 hartree
kineticenergy: 1483.73388546 hartree
xcener: -107.350751103471 hartree
chargesum: 0.0000000
charge: -0.458862 0.697159 -0.314342 -0.295395 -0.347301 -0.489838 -0.279217 0.161112 -0.022967 0.215613 -0.263777 -0.250692 -0.235955 -0.281177 0.500281 -0.235530 -0.113152 0.061999 0.087850 0.093523 0.162576 0.089200 0.094934 0.094866 0.095970 0.089018 0.088046 0.090963 0.073201 0.082966 0.124726 0.116069 0.103596 0.114483 0.127920 0.105366 0.116768
qa: -0.4589 0.6972 -0.3143 -0.2954 -0.3473 -0.4898 -0.2792 0.1611 -0.0230 0.2156 -0.2638 -0.2507 -0.2360 -0.2812 0.5003 -0.2355 -0.1132 0.0620 0.0878 0.0935 0.1626 0.0892 0.0949 0.0949 0.0960 0.0890 0.0880 0.0910 0.0732 0.0830 0.1247 0.1161 0.1036 0.1145 0.1279 0.1054 0.1168
va: 1.9705 5.4405 2.1401 2.1296 2.0873 2.0097 3.1417 3.8175 3.8919 3.7711 3.9087 3.9299 3.8944 3.8596 4.1319 3.8811 3.8543 1.0240 1.0197 0.9980 1.0218 1.0067 1.0060 1.0166 1.0086 1.0056 1.0071 1.0109 1.0145 1.0063 1.0310 1.0051 1.0257 1.0398 0.9904 1.0001 0.9966
dispcorr: -0.016151364 hartree
energy: -1488.546402429213
dipole: 13.08215 -14.14943 -1.06728 8.05745 -7.29039 0.76707 -4.38407 2.42543 -1.95863
magnitude: 2.35876 au
magnitude: 5.99549 debye
