program: Orca
programVersion: 5.0.2
elementType: S P O O O O N C C C C C C C C C C H H H H H H H H H H H H H H H H H H H H
charge: 0
multiplicity: 1
keywords: wb97x-d3
keywords: def2-TZVPP
keywords: def2/J RIJCOSX
keywords: DEFGRID2
keywords: scfconv7
keywords: smallprint printgap noloewdin
keywords: NOSOSCF
formula: C10H20NO4PS
InChI: InChI=1/C10H20NO4PS/c1-6-11-16(17,13-5)15-9(4)7-10(12)14-8(2)3/h7-8,11H,6H2,1-5H3
37 atoms
S  -1.48782 1.414633 1.378668
P  -2.051957 0.147431 0.059749
O  -1.024806 -0.186391 -1.157982
O  3.34725 0.366707 0.177313
O  -2.293815 -1.361091 0.566967
O  2.953433 -1.753676 -0.423775
N  -3.444981 0.554741 -0.730279
C  4.730542 0.090969 0.443927
C  -3.86679 1.934671 -0.93435
C  0.192556 -0.811487 -0.989691
C  4.89107 -0.4849 1.839773
C  5.466523 1.4053 0.274033
C  -3.117163 2.655176 -2.042304
C  1.198726 -0.114802 -0.45405
C  2.563746 -0.626479 -0.246679
C  0.184821 -2.200123 -1.519597
C  -3.019479 -1.581102 1.769325
H  5.097737 -0.631457 -0.289471
H  -3.739153 2.461771 0.010377
H  -4.938304 1.918621 -1.141079
H  -3.72919 -0.083252 -1.461203
H  4.366295 -1.432876 1.945778
H  4.515619 0.208422 2.59368
H  5.946251 -0.665893 2.047143
H  5.115829 2.152878 0.986623
H  5.339787 1.805753 -0.731575
H  6.533154 1.256893 0.442431
H  -2.056585 2.735808 -1.80371
H  -3.210276 2.134198 -2.996149
H  -3.506686 3.664894 -2.175737
H  1.016935 0.90753 -0.150439
H  1.170256 -2.649244 -1.502111
H  -0.192666 -2.20006 -2.543817
H  -0.493538 -2.81701 -0.927358
H  -2.540113 -1.085409 2.61424
H  -4.046477 -1.220849 1.683315
H  -3.031524 -2.655123 1.938653
totalener: -1488.51172062 hartree
nucrepener: 1598.57999420 hartree
electener: -3087.09171482 hartree
oneelecener: -5222.52494947 hartree
twoeener: 2135.43323465 hartree
kineticenergy: 1483.79978342 hartree
xcener: -107.357194281108 hartree
chargesum: -0.0000000
charge: -0.390413 0.669397 -0.343957 -0.270248 -0.332421 -0.406111 -0.266726 0.144061 -0.035928 0.256152 -0.258651 -0.227254 -0.212714 -0.253316 0.436907 -0.242612 -0.124547 0.058435 0.092045 0.081583 0.123126 0.102910 0.084697 0.079201 0.083221 0.090237 0.075119 0.085400 0.066726 0.081368 0.120362 0.118416 0.089262 0.095897 0.111636 0.105662 0.113076
qa: -0.3904 0.6694 -0.3440 -0.2702 -0.3324 -0.4061 -0.2667 0.1441 -0.0359 0.2562 -0.2587 -0.2273 -0.2127 -0.2533 0.4369 -0.2426 -0.1245 0.0584 0.0920 0.0816 0.1231 0.1029 0.0847 0.0792 0.0832 0.0902 0.0751 0.0854 0.0667 0.0814 0.1204 0.1184 0.0893 0.0959 0.1116 0.1057 0.1131
va: 2.0532 5.4774 2.1148 2.1435 2.1001 2.0913 3.1024 3.8550 3.9165 3.6780 3.9136 3.9252 3.8928 3.9473 4.1914 3.9536 3.8837 1.0249 1.0259 0.9969 1.0464 1.0162 1.0082 1.0089 1.0097 1.0115 1.0078 1.0164 1.0098 1.0126 1.0378 1.0346 1.0043 1.0111 1.0030 0.9933 0.9910
dispcorr: -0.016002478 hartree
energy: -1488.527723097051
dipole: 8.62324 -9.61099 -0.98775 2.22510 -2.36892 -0.14382 -1.39167 0.91278 -0.47889
magnitude: 1.10710 au
magnitude: 2.81402 debye
