program: Orca
programVersion: 5.0.2
elementType: S P O O O O N C C C C C C C C C C H H H H H H H H H H H H H H H H H H H H
charge: 0
multiplicity: 1
keywords: wb97x-d3
keywords: def2-TZVPP
keywords: def2/J RIJCOSX
keywords: DEFGRID2
keywords: scfconv7
keywords: smallprint printgap noloewdin
keywords: NOSOSCF
formula: C10H20NO4PS
InChI: InChI=1/C10H20NO4PS/c1-6-11-16(17,13-5)15-9(4)7-10(12)14-8(2)3/h7-8,11H,6H2,1-5H3
37 atoms
S  -2.531082 -1.68708 -0.209979
P  -2.008659 0.148408 -0.385608
O  -0.940398 0.708597 0.705676
O  3.464902 0.1037 -0.440996
O  -1.224252 0.555757 -1.728423
O  2.961868 -1.061893 1.403704
N  -3.250782 1.234776 -0.300806
C  4.838261 -0.307931 -0.388893
C  -4.447917 0.993193 0.494858
C  0.220812 0.042783 1.039536
C  5.612713 0.58584 0.563197
C  5.35945 -0.229937 -1.810184
C  -4.242471 1.141137 1.993122
C  1.295039 0.243701 0.271032
C  2.630242 -0.325388 0.509666
C  0.075472 -0.769437 2.273569
C  -1.707054 0.092682 -2.982846
H  4.888852 -1.341548 -0.037309
H  -4.802184 -0.010395 0.261617
H  -5.214563 1.684542 0.141294
H  -2.981774 2.206644 -0.37264
H  5.237292 0.507021 1.582254
H  5.557614 1.62965 0.250299
H  6.663706 0.295307 0.575428
H  4.784709 -0.870053 -2.479278
H  6.397827 -0.559429 -1.843079
H  5.319368 0.790482 -2.193525
H  -3.540162 0.395069 2.364842
H  -3.855039 2.127964 2.249749
H  -5.18476 1.004036 2.524312
H  1.197874 0.886123 -0.593452
H  -0.642346 -1.572398 2.090565
H  -0.331839 -0.150341 3.075191
H  1.016281 -1.199856 2.594352
H  -1.819672 -0.992464 -2.985428
H  -2.667702 0.549404 -3.228815
H  -0.971716 0.38056 -3.730487
totalener: -1488.51222292 hartree
nucrepener: 1595.35658827 hartree
electener: -3083.86881118 hartree
oneelecener: -5215.94924780 hartree
twoeener: 2132.08043661 hartree
kineticenergy: 1483.80467285 hartree
xcener: -107.357856419409 hartree
chargesum: -0.0000000
charge: -0.394763 0.667939 -0.340035 -0.274658 -0.331224 -0.401600 -0.265581 0.141771 -0.040095 0.236220 -0.257802 -0.227698 -0.208086 -0.258304 0.445466 -0.229486 -0.121638 0.061683 0.092845 0.081147 0.124937 0.102941 0.082007 0.079863 0.090893 0.076611 0.080613 0.078696 0.068538 0.082172 0.114820 0.101905 0.089880 0.120492 0.109866 0.106332 0.113336
qa: -0.3948 0.6679 -0.3400 -0.2747 -0.3312 -0.4016 -0.2656 0.1418 -0.0401 0.2362 -0.2578 -0.2277 -0.2081 -0.2583 0.4455 -0.2295 -0.1216 0.0617 0.0928 0.0811 0.1249 0.1029 0.0820 0.0799 0.0909 0.0766 0.0806 0.0787 0.0685 0.0822 0.1148 0.1019 0.0899 0.1205 0.1099 0.1063 0.1133
va: 2.0405 5.4786 2.1116 2.1376 2.1028 2.0963 3.0992 3.8575 3.9227 3.7258 3.9125 3.9264 3.8895 3.9573 4.1695 3.9415 3.8790 1.0243 1.0240 0.9975 1.0458 1.0166 1.0084 1.0094 1.0113 1.0082 1.0094 1.0154 1.0100 1.0132 1.0379 1.0180 1.0031 1.0361 1.0044 0.9940 0.9909
dispcorr: -0.016230281 hartree
energy: -1488.528453199681
dipole: 10.14189 -10.49073 -0.34884 5.57841 -4.21952 1.35889 0.58026 -1.27215 -0.69189
magnitude: 1.56428 au
magnitude: 3.97608 debye
