program: Orca
programVersion: 5.0.2
elementType: S P O O O O N C C C C C C C C C C H H H H H H H H H H H H H H H H H H H H
charge: 0
multiplicity: 1
keywords: wb97x-d3
keywords: def2-TZVPP
keywords: def2/J RIJCOSX
keywords: DEFGRID2
keywords: scfconv7
keywords: smallprint printgap noloewdin
keywords: NOSOSCF
formula: C10H20NO4PS
InChI: InChI=1/C10H20NO4PS/c1-6-11-16(17,13-5)15-9(4)7-10(12)14-8(2)3/h7-8,11H,6H2,1-5H3
37 atoms
S  -2.520277 1.014867 1.671541
P  -2.242227 0.052834 0.039385
O  -0.720703 -0.452493 -0.26907
O  3.749511 -0.998269 0.281558
O  -2.958201 -1.379843 -0.067925
O  3.296668 1.151238 -0.151228
N  -2.684646 0.831801 -1.347147
C  5.157695 -0.73264 0.359881
C  -3.757028 1.817922 -1.388278
C  0.444474 0.260128 -0.22278
C  5.767716 -0.700623 -1.03065
C  5.748354 -1.828647 1.225335
C  -5.153052 1.218161 -1.386639
C  1.540356 -0.479341 -0.004788
C  2.920637 0.018068 0.022602
C  0.362193 1.725863 -0.46042
C  -2.837719 -2.332018 0.981666
H  5.311106 0.236018 0.842568
H  -3.601083 2.42807 -2.27943
H  -3.629779 2.479741 -0.532187
H  -2.56843 0.298559 -2.198333
H  6.841302 -0.522487 -0.960443
H  5.340834 0.095718 -1.637986
H  5.61952 -1.651374 -1.545161
H  5.295033 -1.840719 2.216337
H  6.818916 -1.66638 1.349965
H  5.609088 -2.811618 0.773362
H  -5.906407 2.002576 -1.462488
H  -5.297982 0.536249 -2.225611
H  -5.337503 0.665091 -0.465828
H  1.411402 -1.541542 0.157468
H  -0.133332 1.930436 -1.410075
H  1.348896 2.17227 -0.470156
H  -0.23179 2.203165 0.321358
H  -3.054835 -1.878957 1.950561
H  -3.563547 -3.117629 0.782376
H  -1.837215 -2.768115 1.005751
totalener: -1488.51162905 hartree
nucrepener: 1571.27703536 hartree
electener: -3059.78866441 hartree
oneelecener: -5167.61840044 hartree
twoeener: 2107.82973603 hartree
kineticenergy: 1483.79636668 hartree
xcener: -107.360112341856 hartree
chargesum: -0.0000000
charge: -0.383424 0.646096 -0.301999 -0.276703 -0.325060 -0.411481 -0.265121 0.145090 -0.035377 0.219479 -0.260000 -0.227966 -0.213228 -0.277543 0.448421 -0.240074 -0.120384 0.060389 0.082966 0.092292 0.126121 0.080291 0.103488 0.080933 0.091365 0.075771 0.080734 0.082167 0.067600 0.084206 0.106528 0.094951 0.129699 0.108745 0.105699 0.114263 0.111069
qa: -0.3834 0.6461 -0.3020 -0.2767 -0.3251 -0.4115 -0.2651 0.1451 -0.0354 0.2195 -0.2600 -0.2280 -0.2132 -0.2775 0.4484 -0.2401 -0.1204 0.0604 0.0830 0.0923 0.1261 0.0803 0.1035 0.0809 0.0914 0.0758 0.0807 0.0822 0.0676 0.0842 0.1065 0.0950 0.1297 0.1087 0.1057 0.1143 0.1111
va: 2.0459 5.4869 2.1609 2.1341 2.1081 2.0853 3.0782 3.8562 3.9078 3.7739 3.9106 3.9260 3.9115 3.8833 4.1738 3.8787 3.8678 1.0243 0.9966 1.0238 1.0458 1.0092 1.0172 1.0084 1.0115 1.0082 1.0096 1.0122 1.0091 1.0169 1.0377 1.0130 1.0416 1.0230 1.0075 0.9897 0.9905
dispcorr: -0.015959779 hartree
energy: -1488.527588828977
dipole: 10.21793 -10.66956 -0.45163 -2.91793 2.11038 -0.80755 -5.77430 4.83753 -0.93676
magnitude: 1.31667 au
magnitude: 3.34672 debye
