program: Orca
programVersion: 5.0.2
elementType: S P O O O O N C C C C C C C C C C H H H H H H H H H H H H H H H H H H H H
charge: 0
multiplicity: 1
keywords: wb97x-d3
keywords: def2-TZVPP
keywords: def2/J RIJCOSX
keywords: DEFGRID2
keywords: scfconv7
keywords: smallprint printgap noloewdin
keywords: NOSOSCF
formula: C10H20NO4PS
InChI: InChI=1/C10H20NO4PS/c1-6-11-16(17,13-5)15-9(4)7-10(12)14-8(2)3/h7-8,11H,6H2,1-5H3
37 atoms
S  -3.160247 -2.060249 0.393482
P  -2.304831 -0.357402 0.172676
O  -0.981855 -0.020887 1.053382
O  3.297472 0.668199 -0.389336
O  -1.673783 -0.0758 -1.278397
O  3.082974 -1.397309 0.451716
N  -3.296954 0.908877 0.542101
C  4.696401 0.473683 -0.64567
C  -2.878562 2.282689 0.805623
C  0.241466 -0.635133 0.912181
C  5.500349 0.693782 0.62391
C  5.067303 1.455791 -1.739537
C  -2.222455 2.958259 -0.385162
C  1.207941 0.095264 0.348502
C  2.603462 -0.328946 0.166869
C  0.306097 -2.008161 1.476728
C  -2.436745 -0.343432 -2.444778
H  4.854942 -0.547723 -1.001406
H  -2.217231 2.335871 1.675089
H  -3.784033 2.830397 1.068867
H  -4.1342 0.612413 1.017159
H  6.563783 0.573349 0.414752
H  5.233701 -0.023269 1.398286
H  5.348123 1.701852 1.012392
H  4.914785 2.486592 -1.417007
H  4.478749 1.288845 -2.641421
H  6.118951 1.34001 -2.000991
H  -2.866144 2.914299 -1.263135
H  -2.035215 4.006592 -0.153521
H  -1.26695 2.504953 -0.641676
H  0.960371 1.089708 0.000939
H  -0.285373 -2.693706 0.865998
H  -0.138612 -2.018696 2.472307
H  1.324226 -2.374412 1.526595
H  -3.306112 0.313774 -2.508705
H  -1.787822 -0.157126 -3.296734
H  -2.774076 -1.380266 -2.465686
totalener: -1488.50991734 hartree
nucrepener: 1600.61837444 hartree
electener: -3089.12829177 hartree
oneelecener: -5226.28577259 hartree
twoeener: 2137.15748082 hartree
kineticenergy: 1483.79882996 hartree
xcener: -107.358427976200 hartree
chargesum: -0.0000000
charge: -0.389632 0.584721 -0.325430 -0.276004 -0.296699 -0.401252 -0.254795 0.143044 -0.035334 0.249057 -0.258058 -0.228487 -0.244300 -0.260910 0.439591 -0.221949 -0.117344 0.061371 0.090250 0.081048 0.144452 0.080281 0.103648 0.081653 0.081087 0.090588 0.077173 0.078373 0.089801 0.083750 0.105035 0.095986 0.099311 0.119657 0.098412 0.115877 0.116029
qa: -0.3896 0.5847 -0.3254 -0.2760 -0.2967 -0.4013 -0.2548 0.1430 -0.0353 0.2491 -0.2581 -0.2285 -0.2443 -0.2609 0.4396 -0.2219 -0.1173 0.0614 0.0903 0.0810 0.1445 0.0803 0.1036 0.0817 0.0811 0.0906 0.0772 0.0784 0.0898 0.0837 0.1050 0.0960 0.0993 0.1197 0.0984 0.1159 0.1160
va: 2.0789 5.5423 2.1047 2.1367 2.0601 2.0965 3.0683 3.8571 3.9266 3.7163 3.9088 3.9272 3.9167 3.9404 4.1911 3.9302 3.8604 1.0230 0.9982 0.9938 1.0383 1.0092 1.0178 1.0084 1.0095 1.0112 1.0083 1.0091 1.0117 1.0093 1.0312 1.0207 1.0064 1.0334 0.9948 0.9904 1.0088
dispcorr: -0.016812213 hartree
energy: -1488.526729550046
dipole: 16.37438 -16.52030 -0.14592 14.69951 -13.01057 1.68894 -6.14222 5.64158 -0.50065
magnitude: 1.76761 au
magnitude: 4.49291 debye
