program: Orca
programVersion: 5.0.2
elementType: S P O O O O N C C C C C C C C C C H H H H H H H H H H H H H H H H H H H H
charge: 0
multiplicity: 1
keywords: wb97x-d3
keywords: def2-TZVPP
keywords: def2/J RIJCOSX
keywords: DEFGRID2
keywords: scfconv7
keywords: smallprint printgap noloewdin
keywords: NOSOSCF
formula: C10H20NO4PS
InChI: InChI=1/C10H20NO4PS/c1-6-11-16(17,13-5)15-9(4)7-10(12)14-8(2)3/h7-8,11H,6H2,1-5H3
37 atoms
S  -1.699376 -0.292775 2.423546
P  -2.170557 -0.098249 0.582332
O  -1.382129 -1.068611 -0.483441
O  2.890789 0.575546 0.292473
O  -3.65318 -0.525547 0.149396
O  2.914489 -1.199619 -1.068839
N  -1.995101 1.417172 -0.016934
C  4.319159 0.695953 0.238362
C  -2.240962 1.842112 -1.38504
C  -0.046063 -1.185576 -0.708512
C  4.726836 1.4428 1.493293
C  4.743048 1.41962 -1.027775
C  -1.097473 2.688259 -1.916259
C  0.852046 -0.348037 -0.17053
C  2.303183 -0.411175 -0.390408
C  0.205858 -2.341659 -1.612762
C  -4.184026 -1.791046 0.519242
H  4.762063 -0.303433 0.247557
H  -3.185542 2.389524 -1.446384
H  -2.362707 0.954935 -2.005971
H  -1.877895 2.139898 0.675156
H  4.405603 0.915904 2.391435
H  4.300386 2.446579 1.514957
H  5.811864 1.539152 1.531781
H  4.462856 0.864417 -1.92122
H  5.826892 1.539865 -1.040283
H  4.296184 2.413792 -1.077592
H  -1.296129 3.000692 -2.941519
H  -0.96007 3.591747 -1.320162
H  -0.162886 2.128915 -1.901163
H  0.524972 0.438713 0.494263
H  1.255085 -2.445872 -1.857953
H  -0.368747 -2.227571 -2.53367
H  -0.137901 -3.26031 -1.133057
H  -5.254871 -1.753498 0.333748
H  -3.747021 -2.592415 -0.078403
H  -4.011228 -1.997385 1.577048
totalener: -1488.51377514 hartree
nucrepener: 1614.70059916 hartree
electener: -3103.21437430 hartree
oneelecener: -5254.44250570 hartree
twoeener: 2151.22813141 hartree
kineticenergy: 1483.80242716 hartree
xcener: -107.362698759881 hartree
chargesum: -0.0000000
charge: -0.365584 0.585322 -0.308939 -0.271967 -0.313634 -0.410845 -0.240244 0.141312 -0.047824 0.287430 -0.228805 -0.259121 -0.225220 -0.266534 0.433682 -0.242167 -0.117654 0.059772 0.094121 0.083192 0.141734 0.094507 0.079744 0.075508 0.103545 0.080571 0.079476 0.082717 0.071963 0.090272 0.081480 0.123241 0.087943 0.093519 0.114322 0.109957 0.103209
qa: -0.3656 0.5853 -0.3089 -0.2720 -0.3136 -0.4108 -0.2402 0.1413 -0.0478 0.2874 -0.2288 -0.2591 -0.2252 -0.2665 0.4337 -0.2422 -0.1177 0.0598 0.0941 0.0832 0.1417 0.0945 0.0797 0.0755 0.1035 0.0806 0.0795 0.0827 0.0720 0.0903 0.0815 0.1232 0.0879 0.0935 0.1143 0.1100 0.1032
va: 2.0910 5.5308 2.1448 2.1355 2.1058 2.0899 3.0484 3.8598 3.9112 3.6678 3.9281 3.9037 3.9303 3.7722 4.2374 3.9468 3.8639 1.0238 0.9980 1.0107 1.0390 1.0113 1.0096 1.0079 1.0178 1.0097 1.0087 1.0118 1.0050 1.0034 1.0824 1.0372 1.0044 1.0042 0.9908 0.9908 1.0081
dispcorr: -0.016812431 hartree
energy: -1488.530587570085
dipole: 14.13924 -14.72595 -0.58671 8.87129 -8.16305 0.70824 -10.93220 10.05991 -0.87229
magnitude: 1.26757 au
magnitude: 3.22191 debye
