program: Orca
programVersion: 5.0.2
elementType: S P O O O O N C C C C C C C C C C H H H H H H H H H H H H H H H H H H H H
charge: 0
multiplicity: 1
keywords: wb97x-d3
keywords: def2-TZVPP
keywords: def2/J RIJCOSX
keywords: DEFGRID2
keywords: scfconv7
keywords: smallprint printgap noloewdin
keywords: NOSOSCF
formula: C10H20NO4PS
InChI: InChI=1/C10H20NO4PS/c1-6-11-16(17,13-5)15-9(4)7-10(12)14-8(2)3/h7-8,11H,6H2,1-5H3
37 atoms
S  -1.860009 0.146668 2.324707
P  -2.11025 0.0535 0.427541
O  -1.026961 -0.867869 -0.384021
O  3.174365 -0.236447 0.076284
O  -3.435342 -0.669281 -0.117373
O  2.862102 1.500126 -1.298307
N  -2.117109 1.5097 -0.326419
C  4.58254 0.035055 0.1811
C  -2.376027 1.738807 -1.738914
C  0.32735 -0.782411 -0.142137
C  5.324537 -0.535913 -1.014112
C  5.033429 -0.583371 1.489341
C  -3.809608 2.144684 -2.036016
C  0.993977 0.221471 -0.722617
C  2.425604 0.55901 -0.68537
C  0.799893 -1.894321 0.723516
C  -3.750578 -1.993657 0.289652
H  4.731778 1.117002 0.21703
H  -2.121433 0.830707 -2.286382
H  -1.682941 2.505806 -2.092259
H  -2.151004 2.30798 0.286549
H  5.002239 -0.074423 -1.945849
H  5.178082 -1.614606 -1.087703
H  6.394002 -0.351151 -0.907172
H  6.092782 -0.38211 1.647968
H  4.897807 -1.666025 1.486693
H  4.48442 -0.170745 2.335417
H  -4.080335 3.058623 -1.505938
H  -3.939733 2.33236 -3.102224
H  -4.505675 1.362268 -1.73893
H  0.428878 0.914308 -1.331777
H  0.369571 -1.774242 1.720497
H  1.877636 -1.93712 0.807396
H  0.435532 -2.843469 0.326648
H  -4.789275 -2.171508 0.021062
H  -3.120383 -2.723597 -0.220805
H  -3.636753 -2.112661 1.368879
totalener: -1488.51040483 hartree
nucrepener: 1607.89823487 hartree
electener: -3096.40863970 hartree
oneelecener: -5240.75777530 hartree
twoeener: 2144.34913560 hartree
kineticenergy: 1483.79324052 hartree
xcener: -107.357806130118 hartree
chargesum: -0.0000000
charge: -0.391080 0.620339 -0.344625 -0.288367 -0.311288 -0.382077 -0.244079 0.137434 -0.050622 0.231721 -0.253920 -0.239315 -0.237300 -0.240450 0.420768 -0.213904 -0.115250 0.068265 0.091261 0.100582 0.141242 0.104891 0.079813 0.082358 0.084683 0.078743 0.097489 0.070417 0.081804 0.088255 0.114283 0.102118 0.099612 0.091363 0.113281 0.109183 0.102373
qa: -0.3911 0.6203 -0.3446 -0.2884 -0.3113 -0.3821 -0.2441 0.1374 -0.0506 0.2317 -0.2539 -0.2393 -0.2373 -0.2404 0.4208 -0.2139 -0.1152 0.0683 0.0913 0.1006 0.1412 0.1049 0.0798 0.0824 0.0847 0.0787 0.0975 0.0704 0.0818 0.0883 0.1143 0.1021 0.0996 0.0914 0.1133 0.1092 0.1024
va: 2.0622 5.5134 2.0632 2.1147 2.0947 2.1163 3.0869 3.8514 3.8792 3.7305 3.9068 3.9231 3.9589 3.9306 4.2613 3.9458 3.8633 1.0226 1.0083 0.9911 1.0403 1.0187 1.0082 1.0093 1.0085 1.0077 1.0103 1.0062 1.0099 1.0132 1.0259 1.0214 1.0315 1.0051 0.9918 0.9913 1.0092
dispcorr: -0.017242644 hartree
energy: -1488.527647469516
dipole: 11.51188 -11.75975 -0.24787 -3.65143 2.96246 -0.68898 -6.46751 5.97149 -0.49603
magnitude: 0.88440 au
magnitude: 2.24798 debye
