program: Orca
programVersion: 5.0.2
elementType: S P O O O O N C C C C C C C C C C H H H H H H H H H H H H H H H H H H H H
charge: 0
multiplicity: 1
keywords: wb97x-d3
keywords: def2-TZVPP
keywords: def2/J RIJCOSX
keywords: DEFGRID2
keywords: scfconv7
keywords: smallprint printgap noloewdin
keywords: NOSOSCF
formula: C10H20NO4PS
InChI: InChI=1/C10H20NO4PS/c1-6-11-16(17,13-5)15-9(4)7-10(12)14-8(2)3/h7-8,11H,6H2,1-5H3
37 atoms
S  -1.985062 0.313167 2.115487
P  -2.255945 -0.178899 0.285543
O  -1.349651 -1.438756 -0.265703
O  2.754751 0.620508 0.370141
O  -3.686738 -0.797101 -0.090554
O  2.937615 -1.201618 -0.916475
N  -2.046604 1.003195 -0.830794
C  4.156364 0.905217 0.252649
C  -1.743236 2.40058 -0.57272
C  -0.009326 -1.461684 -0.49729
C  4.51736 1.751152 1.45765
C  4.4453 1.615173 -1.058349
C  -0.416482 2.828523 -1.176385
C  0.819976 -0.540107 0.012454
C  2.26209 -0.456867 -0.250492
C  0.334885 -2.624849 -1.361937
C  -4.206357 -1.908943 0.627997
H  4.714516 -0.034104 0.284854
H  -1.73042 2.540954 0.507341
H  -2.555177 3.021816 -0.958755
H  -2.175064 0.751112 -1.799898
H  3.974463 2.697252 1.45617
H  5.583539 1.977058 1.445974
H  4.295784 1.232211 2.389781
H  3.874402 2.542117 -1.13342
H  4.209451 0.988193 -1.916428
H  5.504158 1.869634 -1.116148
H  0.413289 2.267429 -0.748137
H  -0.399583 2.680086 -2.257321
H  -0.242036 3.888278 -0.98948
H  0.432457 0.21416 0.683838
H  1.401332 -2.702758 -1.532995
H  -0.173877 -2.542041 -2.324272
H  -0.018286 -3.545255 -0.893272
H  -5.261024 -1.985707 0.374456
H  -3.702619 -2.833323 0.341444
H  -4.107439 -1.765267 1.705323
totalener: -1488.51180913 hartree
nucrepener: 1625.12747821 hartree
electener: -3113.63928733 hartree
oneelecener: -5275.30199195 hartree
twoeener: 2161.66270462 hartree
kineticenergy: 1483.79193955 hartree
xcener: -107.362245981148 hartree
chargesum: -0.0000000
charge: -0.379704 0.623698 -0.313623 -0.274215 -0.324462 -0.409200 -0.224261 0.136024 -0.039113 0.250951 -0.229067 -0.261094 -0.206646 -0.278189 0.445146 -0.238063 -0.123775 0.064672 0.093252 0.088921 0.122203 0.081148 0.076027 0.093564 0.079989 0.104003 0.084045 0.072073 0.068705 0.083341 0.103379 0.122017 0.085487 0.093050 0.114830 0.111526 0.103360
qa: -0.3797 0.6237 -0.3136 -0.2742 -0.3245 -0.4092 -0.2243 0.1360 -0.0391 0.2510 -0.2291 -0.2611 -0.2066 -0.2782 0.4451 -0.2381 -0.1238 0.0647 0.0933 0.0889 0.1222 0.0811 0.0760 0.0936 0.0800 0.1040 0.0840 0.0721 0.0687 0.0833 0.1034 0.1220 0.0855 0.0930 0.1148 0.1115 0.1034
va: 2.0544 5.5100 2.1645 2.1249 2.1286 2.0922 3.0975 3.8585 3.8717 3.7571 3.9302 3.9078 3.9125 3.7612 4.2114 3.9494 3.8744 1.0242 1.0319 0.9957 1.0456 1.0090 1.0078 1.0116 1.0072 1.0175 1.0101 1.0178 1.0077 1.0143 1.0638 1.0364 1.0054 1.0047 0.9901 0.9912 1.0072
dispcorr: -0.017176345 hartree
energy: -1488.528985472714
dipole: 16.22815 -16.62576 -0.39760 9.72802 -9.40837 0.31964 -7.25677 6.33274 -0.92402
magnitude: 1.05550 au
magnitude: 2.68287 debye
