program: Orca
programVersion: 5.0.2
elementType: S P O O O O N C C C C C C C C C C H H H H H H H H H H H H H H H H H H H H
charge: 0
multiplicity: 1
keywords: wb97x-d3
keywords: def2-TZVPP
keywords: def2/J RIJCOSX
keywords: DEFGRID2
keywords: scfconv7
keywords: smallprint printgap noloewdin
keywords: NOSOSCF
formula: C10H20NO4PS
InChI: InChI=1/C10H20NO4PS/c1-6-11-16(17,13-5)15-9(4)7-10(12)14-8(2)3/h7-8,11H,6H2,1-5H3
37 atoms
S  -1.85264 0.120445 2.321318
P  -2.109225 0.04673 0.424118
O  -1.026334 -0.862358 -0.40163
O  3.175581 -0.242435 0.072063
O  -3.434385 -0.674797 -0.122892
O  2.863639 1.525614 -1.261825
N  -2.121352 1.510435 -0.315591
C  4.584945 0.02219 0.178188
C  -2.380916 1.751353 -1.726094
C  0.327975 -0.780899 -0.156291
C  5.320476 -0.516631 -1.035757
C  5.039677 -0.634744 1.466108
C  -3.817977 2.145141 -2.022084
C  0.99485 0.235512 -0.714062
C  2.426922 0.570945 -0.670325
C  0.799303 -1.910996 0.686096
C  -3.744969 -2.002872 0.274941
H  4.737537 1.102289 0.244318
H  -2.115599 0.851593 -2.28226
H  -1.695256 2.529212 -2.070114
H  -2.163611 2.302418 0.305168
H  4.995406 -0.028732 -1.952919
H  5.171479 -1.592583 -1.138738
H  6.39078 -0.337063 -0.928263
H  6.099854 -0.439487 1.626884
H  4.902741 -1.716715 1.431957
H  4.494023 -0.24652 2.325821
H  -3.947988 2.341728 -3.086788
H  -4.506509 1.352681 -1.734037
H  -4.099137 3.051102 -1.483698
H  0.429937 0.941996 -1.307459
H  0.365856 -1.813189 1.684169
H  1.876813 -1.954596 0.772362
H  0.437197 -2.851553 0.26732
H  -3.633858 -2.127846 1.353779
H  -4.781966 -2.183721 0.00186
H  -3.109936 -2.727008 -0.23776
totalener: -1488.51038879 hartree
nucrepener: 1608.02292908 hartree
electener: -3096.53331787 hartree
oneelecener: -5241.00913179 hartree
twoeener: 2144.47581392 hartree
kineticenergy: 1483.79247459 hartree
xcener: -107.357603742445 hartree
chargesum: -0.0000000
charge: -0.390783 0.620732 -0.344926 -0.288362 -0.311405 -0.381982 -0.244669 0.137957 -0.050622 0.230998 -0.253825 -0.239679 -0.237238 -0.238892 0.420439 -0.213932 -0.115489 0.067943 0.091379 0.100533 0.141158 0.104935 0.079766 0.082277 0.084861 0.078603 0.097695 0.081804 0.088448 0.070320 0.114242 0.101719 0.099630 0.091411 0.102506 0.113337 0.109111
qa: -0.3908 0.6207 -0.3449 -0.2884 -0.3114 -0.3820 -0.2447 0.1380 -0.0506 0.2310 -0.2538 -0.2397 -0.2372 -0.2389 0.4204 -0.2139 -0.1155 0.0679 0.0914 0.1005 0.1412 0.1049 0.0798 0.0823 0.0849 0.0786 0.0977 0.0818 0.0884 0.0703 0.1142 0.1017 0.0996 0.0914 0.1025 0.1133 0.1091
va: 2.0623 5.5128 2.0632 2.1150 2.0943 2.1164 3.0870 3.8516 3.8791 3.7311 3.9062 3.9230 3.9587 3.9286 4.2627 3.9461 3.8634 1.0224 1.0083 0.9911 1.0403 1.0188 1.0082 1.0093 1.0085 1.0078 1.0102 1.0099 1.0133 1.0062 1.0262 1.0214 1.0315 1.0050 1.0091 0.9919 0.9913
dispcorr: -0.017249216 hartree
energy: -1488.527638009911
dipole: 11.47850 -11.72990 -0.25140 -3.70884 3.01377 -0.69507 -6.60210 6.08943 -0.51266
magnitude: 0.89953 au
magnitude: 2.28642 debye
