program: Orca
programVersion: 5.0.2
elementType: S P O O O O N C C C C C C C C C C H H H H H H H H H H H H H H H H H H H H
charge: 0
multiplicity: 1
keywords: wb97x-d3
keywords: def2-TZVPP
keywords: def2/J RIJCOSX
keywords: DEFGRID2
keywords: scfconv7
keywords: smallprint printgap noloewdin
keywords: NOSOSCF
formula: C10H20NO4PS
InChI: InChI=1/C10H20NO4PS/c1-6-11-16(17,13-5)15-9(4)7-10(12)14-8(2)3/h7-8,11H,6H2,1-5H3
37 atoms
S  -1.974179 0.361405 2.099718
P  -2.262665 -0.176091 0.284855
O  -1.35292 -1.440524 -0.251078
O  2.743875 0.633263 0.374996
O  -3.691996 -0.81584 -0.054587
O  2.930024 -1.177552 -0.927784
N  -2.07647 0.981046 -0.861079
C  4.146329 0.916919 0.268419
C  -1.792136 2.388362 -0.637174
C  -0.013241 -1.458192 -0.48881
C  4.503562 1.739578 1.490235
C  4.441249 1.649807 -1.027898
C  -0.457175 2.814677 -1.223775
C  0.812409 -0.527487 0.009645
C  2.253693 -0.439603 -0.255143
C  0.334836 -2.627851 -1.34313
C  -4.19071 -1.914158 0.698509
H  4.702146 -0.024085 0.285317
H  -1.804624 2.560503 0.438163
H  -2.602244 2.988383 -1.058768
H  -2.183968 0.700712 -1.824625
H  4.276339 1.203422 2.411114
H  3.962227 2.6865 1.504396
H  5.570151 1.963295 1.488212
H  5.501282 1.900572 -1.07891
H  3.87451 2.580421 -1.087247
H  4.204833 1.039604 -1.897678
H  -0.301393 3.882339 -1.06789
H  0.369716 2.279678 -0.758282
H  -0.412733 2.631238 -2.298449
H  0.422299 0.229628 0.676501
H  -0.020747 -3.54469 -0.869368
H  1.402138 -2.706138 -1.508526
H  -0.168475 -2.552424 -2.308989
H  -5.24804 -2.006252 0.463082
H  -3.683008 -2.840778 0.426867
H  -4.076939 -1.74355 1.770215
totalener: -1488.51182742 hartree
nucrepener: 1625.15373677 hartree
electener: -3113.66556418 hartree
oneelecener: -5275.35918448 hartree
twoeener: 2161.69362030 hartree
kineticenergy: 1483.79884014 hartree
xcener: -107.363495495125 hartree
chargesum: 0.0000000
charge: -0.380669 0.623938 -0.314560 -0.273985 -0.323287 -0.409092 -0.223759 0.135996 -0.037294 0.248380 -0.228623 -0.260716 -0.207567 -0.277495 0.444743 -0.237200 -0.124179 0.064100 0.092554 0.088683 0.122349 0.093340 0.081303 0.075937 0.083904 0.080053 0.103631 0.083739 0.072045 0.069004 0.104923 0.092975 0.121675 0.085266 0.114867 0.111471 0.103550
qa: -0.3807 0.6239 -0.3146 -0.2740 -0.3233 -0.4091 -0.2238 0.1360 -0.0373 0.2484 -0.2286 -0.2607 -0.2076 -0.2775 0.4447 -0.2372 -0.1242 0.0641 0.0926 0.0887 0.1223 0.0933 0.0813 0.0759 0.0839 0.0801 0.1036 0.0837 0.0720 0.0690 0.1049 0.0930 0.1217 0.0853 0.1149 0.1115 0.1035
va: 2.0528 5.5113 2.1642 2.1245 2.1292 2.0925 3.0995 3.8593 3.8720 3.7578 3.9294 3.9084 3.9133 3.7576 4.2117 3.9501 3.8743 1.0246 1.0318 0.9955 1.0453 1.0117 1.0091 1.0078 1.0100 1.0073 1.0173 1.0143 1.0174 1.0079 1.0640 1.0047 1.0363 1.0053 0.9902 0.9912 1.0073
dispcorr: -0.017149763 hartree
energy: -1488.528977180184
dipole: 16.14918 -16.54852 -0.39934 9.56825 -9.28457 0.28369 -7.12079 6.21488 -0.90591
magnitude: 1.02987 au
magnitude: 2.61771 debye
