program: Orca
programVersion: 5.0.2
elementType: S P O O O O N C C C C C C C C C C H H H H H H H H H H H H H H H H H H H H
charge: 0
multiplicity: 1
keywords: wb97x-d3
keywords: def2-TZVPP
keywords: def2/J RIJCOSX
keywords: DEFGRID2
keywords: scfconv7
keywords: smallprint printgap noloewdin
keywords: NOSOSCF
formula: C10H20NO4PS
InChI: InChI=1/C10H20NO4PS/c1-6-11-16(17,13-5)15-9(4)7-10(12)14-8(2)3/h7-8,11H,6H2,1-5H3
37 atoms
S  -2.457499 -0.318935 2.264798
P  -2.340154 -0.040668 0.374798
O  -0.852098 -0.149239 -0.296785
O  3.645987 -0.693347 -0.518998
O  -3.04802 -1.127668 -0.568096
O  3.165189 1.213287 0.552537
N  -2.941462 1.396736 -0.145124
C  5.056798 -0.476346 -0.373262
C  -3.05451 1.816931 -1.533496
C  0.313878 0.432929 0.108714
C  5.723057 -1.236597 -1.50309
C  5.520888 -0.948782 0.99312
C  -4.443603 1.615817 -2.116503
C  1.422314 -0.226479 -0.255455
C  2.801754 0.209593 -0.009606
C  0.214603 1.722823 0.842814
C  -2.747314 -2.510532 -0.428304
H  5.266897 0.591156 -0.477394
H  -2.317837 1.267283 -2.119323
H  -2.765704 2.868701 -1.597465
H  -3.527827 1.871658 0.523136
H  5.377746 -0.887838 -2.476144
H  5.525725 -2.307142 -1.432902
H  6.802635 -1.092378 -1.460706
H  5.04732 -0.384388 1.794792
H  6.599047 -0.814605 1.086835
H  5.301467 -2.008095 1.134796
H  -4.723363 0.563748 -2.103217
H  -5.194109 2.173421 -1.554481
H  -4.479149 1.967082 -3.148088
H  1.303953 -1.162257 -0.786274
H  1.197731 2.127926 1.048352
H  -0.311342 1.579437 1.788598
H  -0.356261 2.447944 0.261076
H  -3.507513 -3.058468 -0.97969
H  -1.766347 -2.743768 -0.843985
H  -2.775604 -2.815551 0.619208
totalener: -1488.51288234 hartree
nucrepener: 1575.71026056 hartree
electener: -3064.22314290 hartree
oneelecener: -5176.40186461 hartree
twoeener: 2112.17872171 hartree
kineticenergy: 1483.79855861 hartree
xcener: -107.361752050870 hartree
chargesum: 0.0000000
charge: -0.372721 0.597116 -0.304826 -0.276721 -0.313691 -0.410628 -0.248722 0.144932 -0.036989 0.238940 -0.228246 -0.258339 -0.232354 -0.279773 0.444321 -0.243220 -0.115765 0.059546 0.087683 0.089274 0.137688 0.089710 0.081475 0.076147 0.103679 0.079256 0.082402 0.090204 0.070267 0.081441 0.106417 0.129912 0.109313 0.095603 0.111426 0.110498 0.104745
qa: -0.3727 0.5971 -0.3048 -0.2767 -0.3137 -0.4106 -0.2487 0.1449 -0.0370 0.2389 -0.2282 -0.2583 -0.2324 -0.2798 0.4443 -0.2432 -0.1158 0.0595 0.0877 0.0893 0.1377 0.0897 0.0815 0.0761 0.1037 0.0793 0.0824 0.0902 0.0703 0.0814 0.1064 0.1299 0.1093 0.0956 0.1114 0.1105 0.1047
va: 2.0764 5.5165 2.1108 2.1332 2.1019 2.0867 3.0569 3.8560 3.8981 3.7322 3.9249 3.9124 3.9470 3.8841 4.1787 3.8867 3.8652 1.0249 1.0117 0.9919 1.0423 1.0113 1.0096 1.0083 1.0166 1.0091 1.0085 1.0133 1.0057 1.0106 1.0367 1.0413 1.0260 1.0033 0.9908 0.9906 1.0082
dispcorr: -0.016235553 hartree
energy: -1488.529117890579
dipole: 12.56251 -12.99450 -0.43199 0.15405 -0.18700 -0.03295 -10.90177 9.53848 -1.36329
magnitude: 1.43047 au
magnitude: 3.63598 debye
