program: Orca
programVersion: 5.0.2
elementType: S P O O O O N C C C C C C C C C C H H H H H H H H H H H H H H H H H H H H
charge: 0
multiplicity: 1
keywords: wb97x-d3
keywords: def2-TZVPP
keywords: def2/J RIJCOSX
keywords: DEFGRID2
keywords: scfconv7
keywords: smallprint printgap noloewdin
keywords: NOSOSCF
formula: C10H20NO4PS
InChI: InChI=1/C10H20NO4PS/c1-6-11-16(17,13-5)15-9(4)7-10(12)14-8(2)3/h7-8,11H,6H2,1-5H3
37 atoms
S  -1.968552 0.805988 1.749175
P  -2.097672 -0.053193 0.040772
O  -0.943933 -1.161499 -0.280596
O  3.196882 -0.2219 0.193418
O  -3.378015 -0.990799 -0.211702
O  3.014889 0.701878 -1.835641
N  -2.080399 0.955472 -1.264312
C  4.595491 0.103579 0.267757
C  -2.541208 2.337007 -1.202627
C  0.390431 -0.94531 -0.005759
C  5.421421 -0.920297 -0.488955
C  4.940713 0.148202 1.742576
C  -4.052971 2.484747 -1.220097
C  1.092807 -0.230737 -0.890209
C  2.520382 0.12609 -0.900087
C  0.805017 -1.619408 1.252268
C  -3.694058 -2.032899 0.702744
H  4.751385 1.09122 -0.173213
H  -2.090447 2.865088 -2.044457
H  -2.127239 2.782219 -0.298957
H  -2.217728 0.505242 -2.159666
H  5.178647 -0.92956 -1.549975
H  5.269166 -1.922598 -0.085261
H  6.481493 -0.681401 -0.395441
H  5.983744 0.438291 1.869616
H  4.807039 -0.826661 2.214327
H  4.325199 0.873537 2.274104
H  -4.498447 2.018154 -0.341496
H  -4.335737 3.53786 -1.218882
H  -4.490965 2.023829 -2.106554
H  0.568493 0.153379 -1.754872
H  1.877047 -1.621138 1.397551
H  0.443481 -2.648994 1.249972
H  0.333591 -1.113367 2.098153
H  -2.994335 -2.864454 0.609551
H  -3.685732 -1.670008 1.732162
H  -4.693718 -2.381583 0.455457
totalener: -1488.50892617 hartree
nucrepener: 1605.50078960 hartree
electener: -3094.00971578 hartree
oneelecener: -5236.05817312 hartree
twoeener: 2142.04845734 hartree
kineticenergy: 1483.79714683 hartree
xcener: -107.356426026614 hartree
chargesum: 0.0000000
charge: -0.398354 0.676455 -0.349537 -0.290043 -0.323481 -0.382829 -0.263904 0.133771 -0.036876 0.231427 -0.254909 -0.236151 -0.213610 -0.244597 0.424437 -0.212193 -0.119382 0.069314 0.084963 0.093144 0.125189 0.105463 0.079956 0.082872 0.083470 0.078122 0.097145 0.083702 0.081905 0.066735 0.107284 0.097797 0.092708 0.101005 0.109164 0.103230 0.116605
qa: -0.3984 0.6765 -0.3495 -0.2900 -0.3235 -0.3828 -0.2639 0.1338 -0.0369 0.2314 -0.2549 -0.2362 -0.2136 -0.2446 0.4244 -0.2122 -0.1194 0.0693 0.0850 0.0931 0.1252 0.1055 0.0800 0.0829 0.0835 0.0781 0.0971 0.0837 0.0819 0.0667 0.1073 0.0978 0.0927 0.1010 0.1092 0.1032 0.1166
va: 2.0364 5.4736 2.0937 2.1125 2.1015 2.1153 3.1221 3.8554 3.9162 3.7149 3.9078 3.9242 3.9036 3.9727 4.2198 3.9490 3.8676 1.0221 0.9976 1.0237 1.0452 1.0189 1.0078 1.0091 1.0083 1.0075 1.0106 1.0170 1.0125 1.0088 1.0452 1.0326 1.0046 1.0202 0.9913 1.0081 0.9909
dispcorr: -0.016852704 hartree
energy: -1488.525778875225
dipole: 10.55029 -10.88126 -0.33097 -0.58847 -0.14613 -0.73461 1.64189 -1.64585 -0.00396
magnitude: 0.80573 au
magnitude: 2.04801 debye
