program: Orca
programVersion: 5.0.2
elementType: S P O O O O N C C C C C C C C C C H H H H H H H H H H H H H H H H H H H H
charge: 0
multiplicity: 1
keywords: wb97x-d3
keywords: def2-TZVPP
keywords: def2/J RIJCOSX
keywords: DEFGRID2
keywords: scfconv7
keywords: smallprint printgap noloewdin
keywords: NOSOSCF
formula: C10H20NO4PS
InChI: InChI=1/C10H20NO4PS/c1-6-11-16(17,13-5)15-9(4)7-10(12)14-8(2)3/h7-8,11H,6H2,1-5H3
37 atoms
S  -1.395871 1.46364 1.358896
P  -1.931384 0.31258 -0.075224
O  -0.840421 -0.004922 -1.240132
O  3.426216 0.184748 0.484415
O  -2.282665 -1.208705 0.319878
O  3.000693 -1.828944 -0.394258
N  -3.246714 0.821815 -0.930395
C  4.757809 -0.204698 0.851995
C  -3.655431 2.208267 -1.092687
C  0.324709 -0.711289 -1.031119
C  5.170512 0.714128 1.984871
C  5.687427 -0.103136 -0.344578
C  -5.162068 2.357244 -0.985482
C  1.328646 -0.106077 -0.390332
C  2.644658 -0.708809 -0.124603
C  0.27407 -2.068942 -1.635081
C  -3.072239 -1.465376 1.472928
H  4.740212 -1.238237 1.208175
H  -3.301836 2.602866 -2.049948
H  -3.165743 2.789359 -0.312226
H  -3.563396 0.196849 -1.659172
H  5.209778 1.754573 1.660031
H  6.161979 0.437584 2.343599
H  4.479713 0.644471 2.824697
H  6.70245 -0.37086 -0.048782
H  5.710656 0.914994 -0.735833
H  5.388342 -0.778426 -1.144398
H  -5.681552 1.779155 -1.751803
H  -5.51579 2.022118 -0.011163
H  -5.45075 3.400658 -1.112589
H  1.180904 0.904101 -0.03249
H  -0.028891 -1.996079 -2.681244
H  -0.478646 -2.672021 -1.124216
H  1.228577 -2.577223 -1.575116
H  -3.172744 -2.545207 1.55223
H  -2.592881 -1.078165 2.37241
H  -4.065102 -1.020228 1.381858
totalener: -1488.51145765 hartree
nucrepener: 1583.21178569 hartree
electener: -3071.72324335 hartree
oneelecener: -5191.76112430 hartree
twoeener: 2120.03788095 hartree
kineticenergy: 1483.79672489 hartree
xcener: -107.357451312989 hartree
chargesum: -0.0000000
charge: -0.391969 0.662341 -0.345478 -0.269438 -0.331035 -0.407961 -0.256940 0.143489 -0.018364 0.254345 -0.227323 -0.260027 -0.229256 -0.257582 0.441741 -0.245303 -0.121173 0.059466 0.087757 0.087016 0.123789 0.081730 0.075384 0.093230 0.079480 0.082384 0.102920 0.067761 0.082580 0.081406 0.121211 0.089382 0.096471 0.119727 0.112649 0.112870 0.102719
qa: -0.3920 0.6623 -0.3455 -0.2694 -0.3310 -0.4080 -0.2569 0.1435 -0.0184 0.2543 -0.2273 -0.2600 -0.2293 -0.2576 0.4417 -0.2453 -0.1212 0.0595 0.0878 0.0870 0.1238 0.0817 0.0754 0.0932 0.0795 0.0824 0.1029 0.0678 0.0826 0.0814 0.1212 0.0894 0.0965 0.1197 0.1126 0.1129 0.1027
va: 2.0526 5.4833 2.1276 2.1460 2.0867 2.0886 3.1046 3.8570 3.8598 3.6856 3.9264 3.9087 3.9341 3.9412 4.1872 3.9510 3.8843 1.0236 0.9946 1.0321 1.0432 1.0096 1.0075 1.0116 1.0092 1.0085 1.0178 1.0048 1.0094 1.0114 1.0382 1.0043 1.0110 1.0348 0.9914 1.0019 0.9931
dispcorr: -0.015543569 hartree
energy: -1488.527001222572
dipole: 4.94791 -6.01924 -1.07133 1.05379 -1.15941 -0.10562 -0.73317 0.25505 -0.47813
magnitude: 1.17793 au
magnitude: 2.99406 debye
