program: Orca
programVersion: 5.0.2
elementType: S P O O O O N C C C C C C C C C C H H H H H H H H H H H H H H H H H H H H
charge: 0
multiplicity: 1
keywords: wb97x-d3
keywords: def2-TZVPP
keywords: def2/J RIJCOSX
keywords: DEFGRID2
keywords: scfconv7
keywords: smallprint printgap noloewdin
keywords: NOSOSCF
formula: C10H20NO4PS
InChI: InChI=1/C10H20NO4PS/c1-6-11-16(17,13-5)15-9(4)7-10(12)14-8(2)3/h7-8,11H,6H2,1-5H3
37 atoms
S  -1.35411 1.360693 1.330579
P  -1.980413 0.153019 -0.015628
O  -0.912283 -0.340639 -1.138372
O  3.454161 0.28155 0.171161
O  -2.47311 -1.294817 0.489173
O  3.047673 -1.876656 -0.261038
N  -3.244263 0.706742 -0.920696
C  4.839186 0.019574 0.443611
C  -3.486401 2.106559 -1.235998
C  0.284365 -0.970824 -0.880435
C  5.013825 -0.504372 1.858185
C  5.568916 1.329901 0.221843
C  -4.965606 2.441404 -1.174693
C  1.305457 -0.233264 -0.435099
C  2.66455 -0.736639 -0.175705
C  0.242986 -2.415708 -1.227224
C  -3.31626 -1.380054 1.630617
H  5.20528 -0.727662 -0.265596
H  -3.081293 2.354994 -2.221424
H  -2.939395 2.706795 -0.50989
H  -3.631085 0.049696 -1.584575
H  6.072599 -0.66616 2.063653
H  4.500442 -1.453312 2.002136
H  4.636573 0.212258 2.589149
H  6.637437 1.19101 0.386536
H  5.220997 2.099925 0.911661
H  5.432212 1.695646 -0.79569
H  -5.126274 3.492935 -1.412502
H  -5.544575 1.853283 -1.888881
H  -5.363543 2.252655 -0.178407
H  1.141192 0.820861 -0.256056
H  1.212245 -2.887808 -1.123779
H  -0.106891 -2.536764 -2.254181
H  -0.473231 -2.929652 -0.583542
H  -4.26993 -0.876687 1.45801
H  -3.499131 -2.437038 1.809827
H  -2.838243 -0.939747 2.506436
totalener: -1488.51136089 hartree
nucrepener: 1581.65153425 hartree
electener: -3070.16289514 hartree
oneelecener: -5188.66109859 hartree
twoeener: 2118.49820345 hartree
kineticenergy: 1483.79179724 hartree
xcener: -107.356344423261 hartree
chargesum: 0.0000000
charge: -0.391358 0.665484 -0.344998 -0.270169 -0.334208 -0.407709 -0.258477 0.144562 -0.020616 0.254063 -0.259207 -0.228336 -0.230835 -0.254942 0.441041 -0.237078 -0.121575 0.058016 0.089321 0.086664 0.124300 0.078832 0.104042 0.084281 0.075100 0.083266 0.090385 0.081157 0.067845 0.083998 0.115815 0.119426 0.088976 0.094935 0.102903 0.113478 0.111619
qa: -0.3914 0.6655 -0.3450 -0.2702 -0.3342 -0.4077 -0.2585 0.1446 -0.0206 0.2541 -0.2592 -0.2283 -0.2308 -0.2549 0.4410 -0.2371 -0.1216 0.0580 0.0893 0.0867 0.1243 0.0788 0.1040 0.0843 0.0751 0.0833 0.0904 0.0812 0.0678 0.0840 0.1158 0.1194 0.0890 0.0949 0.1029 0.1135 0.1116
va: 2.0531 5.4859 2.1253 2.1442 2.0922 2.0904 3.1015 3.8554 3.8600 3.6863 3.9085 3.9263 3.9356 3.9429 4.1892 3.9542 3.8827 1.0238 0.9946 1.0316 1.0428 1.0089 1.0175 1.0083 1.0078 1.0096 1.0115 1.0113 1.0047 1.0091 1.0411 1.0348 1.0044 1.0110 0.9941 0.9912 1.0023
dispcorr: -0.015485937 hartree
energy: -1488.526846829715
dipole: 4.77596 -5.86957 -1.09362 2.48652 -2.49676 -0.01025 0.16445 -0.71187 -0.54742
magnitude: 1.22302 au
magnitude: 3.10866 debye
