program: Orca
programVersion: 5.0.2
elementType: S P O O O O N C C C C C C C C C C H H H H H H H H H H H H H H H H H H H H
charge: 0
multiplicity: 1
keywords: wb97x-d3
keywords: def2-TZVPP
keywords: def2/J RIJCOSX
keywords: DEFGRID2
keywords: scfconv7
keywords: smallprint printgap noloewdin
keywords: NOSOSCF
formula: C10H20NO4PS
InChI: InChI=1/C10H20NO4PS/c1-6-11-16(17,13-5)15-9(4)7-10(12)14-8(2)3/h7-8,11H,6H2,1-5H3
37 atoms
S  -1.434597 1.462054 1.274575
P  -2.128771 0.005773 0.246353
O  -1.062226 -1.134315 -0.230172
O  3.303286 -0.112686 0.752043
O  -3.16615 -0.967377 0.992524
O  3.015717 -0.348678 -1.456035
N  -2.882074 0.406613 -1.16859
C  4.703653 0.160124 0.594102
C  -3.680993 1.612253 -1.340105
C  0.169183 -0.862822 -0.775463
C  5.480272 -1.138663 0.470147
C  5.118477 0.96796 1.807604
C  -3.669969 2.063591 -2.788287
C  1.177481 -0.610678 0.062922
C  2.569348 -0.351462 -0.336105
C  0.170883 -0.937185 -2.260163
C  -2.8826 -1.454602 2.297729
H  4.850328 0.756509 -0.309972
H  -3.250687 2.384183 -0.703088
H  -4.709695 1.456066 -1.000294
H  -3.189774 -0.379539 -1.725853
H  6.546674 -0.926483 0.38619
H  5.185993 -1.700277 -0.415053
H  5.332206 -1.76771 1.349134
H  4.539232 1.887125 1.889833
H  6.170632 1.241155 1.728243
H  4.989046 0.398221 2.728595
H  -4.259387 2.972342 -2.906957
H  -2.653821 2.269409 -3.122333
H  -4.099097 1.30906 -3.450242
H  0.969314 -0.583621 1.124089
H  1.167054 -0.83357 -2.67249
H  -0.464248 -0.146313 -2.666129
H  -0.253929 -1.88949 -2.583139
H  -2.640854 -0.636964 2.978633
H  -3.777825 -1.96234 2.649082
H  -2.054179 -2.165231 2.285634
totalener: -1488.51094533 hartree
nucrepener: 1588.23047352 hartree
electener: -3076.74141885 hartree
oneelecener: -5201.71837477 hartree
twoeener: 2124.97695592 hartree
kineticenergy: 1483.80556154 hartree
xcener: -107.357813441037 hartree
chargesum: -0.0000000
charge: -0.389746 0.667653 -0.349540 -0.270785 -0.324151 -0.407585 -0.266678 0.142965 -0.024685 0.278457 -0.259398 -0.227956 -0.240394 -0.262863 0.447537 -0.254086 -0.125062 0.060220 0.089424 0.087120 0.125724 0.080220 0.102738 0.082072 0.094211 0.075740 0.080800 0.084406 0.086778 0.069727 0.106744 0.122772 0.088949 0.093646 0.107328 0.115983 0.111717
qa: -0.3897 0.6677 -0.3495 -0.2708 -0.3242 -0.4076 -0.2667 0.1430 -0.0247 0.2785 -0.2594 -0.2280 -0.2404 -0.2629 0.4475 -0.2541 -0.1251 0.0602 0.0894 0.0871 0.1257 0.0802 0.1027 0.0821 0.0942 0.0757 0.0808 0.0844 0.0868 0.0697 0.1067 0.1228 0.0889 0.0936 0.1073 0.1160 0.1117
va: 2.0528 5.4890 2.0947 2.1449 2.1024 2.0906 3.1227 3.8563 3.8773 3.6534 3.9114 3.9258 3.9390 3.9621 4.1817 3.9726 3.8704 1.0242 1.0242 0.9922 1.0408 1.0092 1.0166 1.0086 1.0115 1.0076 1.0097 1.0115 1.0070 1.0033 1.0418 1.0391 1.0096 1.0034 1.0062 0.9910 0.9894
dispcorr: -0.015873533 hartree
energy: -1488.526818862547
dipole: 9.86304 -10.60079 -0.73775 1.06167 -1.60037 -0.53870 -4.51042 4.33365 -0.17677
magnitude: 0.93044 au
magnitude: 2.36499 debye
